{"text_format":"1","workbook":"xlsx","n_sheets":4,"sheets":["Instructions","Marks Entry","Report Card","Abstract"],"not_rendered":{"charts":1,"images":1,"macros":1,"external_links":1,"defined_names":3,"comments":0,"pivot_tables":0},"unopened":[],"bounds":{"document_bytes":16777216,"sheet_cells":100000,"rows_first":2000,"rows_last":500,"rows_between":2000,"halvings":0,"cell_chars":16384,"cell_head_chars":4096},"cells_cut":0,"cells_raw":0,"read":"whole","date_system":"1900"}

{"sheet":"Instructions","index":0,"n_rows":33,"n_cols":12,"rows_kept":33,"cut":false,"hidden":false,"merged":[[0,0,0,5],[16,1,16,2],[21,1,21,2],[8,1,8,4],[3,1,3,2],[4,1,4,5],[9,1,9,4],[6,1,6,6],[7,1,7,6]]}
["Instructions",null,null,null,null,null,null,null,null,null,"Year","Month"]
["Kindly read All Instructions before Use Report Card Utitly",null,null,null,null,null,null,null,null,null,2022,"Sept"]
[null,null,null,null,null,null,null,null,null,null,2023,"March"]
[1,"First Fill  Necessary Data for report card by click on ",null,"Fill Data",null,null,null,null,null,null,2024]
[2,"In All Sheet Use only or Click on  Yellow coloured Filled  Cell to Enter or Select Data. Rest Cells Are Locked",null,null,null,null,null,null,null,null,2025]
[3,"Now Goto Marks Entry Sheet . Then Enter Data ( Marks) in Yellow cell thier",null,null,null,null,null,null,null,null,2026]
[4,"Enter Subjects Total Marks for Each Subject in this sheet at Row no . 20 onwards",null,null,null,null,null,null,null,null,2027]
[5,"You can find Grade Wise , Class Wise , Subject Wise Students count and Topper List",null,null,null,null,null,null,null,null,2028]
[6,"you can copy Paste Students Data Like Name ,Father Name, Class Etc.  From Epunjab Student Report Excel File",null,null,null,null,null,null,null,null,2029]
[7,"After Entered All data in yellow cell of Marks Entry 6-8 Sheet . Goto Report Card to View/Print report card of each Students",null,null,null,null,null,null,null,null,2030]
[]
[]
[]
[]
[]
[]
[null,"Select to  Fill Data"]
[null,"Select Year Below","Select Month"]
[null,2024,"March"]
[null,"Enter Date of Report Card Preparation","2024-03-31"]
{"$rows_left_out":14}
{"sheet":"Marks Entry","index":1,"n_rows":403,"n_cols":43,"rows_kept":403,"cut":false,"hidden":false,"merged":[]}
["Sno",null,"Class","Sec","Student ID","Name","FatherName","MotherName","DOB","Gender",{"$f":"Instructions!B23","v":"PUNJABI"},{"$f":"Instructions!B24","v":"ENGLISH"},{"$f":"Instructions!B25","v":"HINDI"},{"$f":"Instructions!B26","v":"MATHEMATICS"},{"$f":"Instructions!B27","v":"ENVIRONMENT EDUCATION"},null,null,null,null,null,"Total Marks ","Total w/o F",null,"Option",{"$f":"Table_2[[#This Row],[Column11]]","v":"PUNJABI"},{"$f":"Table_2[[#This Row],[Column12]]","v":"ENGLISH"},{"$f":"Table_2[[#This Row],[Column13]]","v":"HINDI"},{"$f":"Table_2[[#This Row],[Column14]]","v":"MATHEMATICS"},{"$f":"Table_2[[#This Row],[Column15]]","v":"ENVIRONMENT EDUCATION"},"Total %","Pass/Fail",{"$f":"Table_2[[#This Row],[Column11]]","v":"PUNJABI"},{"$f":"Table_2[[#This Row],[Column12]]","v":"ENGLISH"},{"$f":"Table_2[[#This Row],[Column13]]","v":"HINDI"},{"$f":"Table_2[[#This Row],[Column14]]","v":"MATHEMATICS"},{"$f":"Table_2[[#This Row],[Column15]]","v":"ENVIRONMENT EDUCATION"},"Grade total",null,"Dr/Ph Grade","Dr/phy Total marks",null,null,{"$f":"Table_2[[#This Row],[Column51]]&Table_2[[#This Row],[Column52]]&AM3","v":""}]
[1,null,"3rd",null,null,null,null,null,null,null,null,null,null,null,null,null,null,null,null,null,{"$f":"IF(MIN(Y2:AC2)>=33,SUM(K2:P2),\"--\")","v":"--"},{"$f":"IF(U2=\"--\",0,U2)","v":0},null,null,{"$f":"(K2/Instructions!$C$23)*100","v":0},{"$f":"(L2/Instructions!$C$24)*100","v":0},{"$f":"(M2/Instructions!$C$25)*100","v":0},{"$f":"(N2/Instructions!$C$26)*100","v":0},{"$f":"(O2/Instructions!$C$27)*100","v":0},{"$f":"(U2/'Report Card'!$H$22)*100","v":{"$error":"#VALUE!"}},{"$f":"IF(AND(Y2>=33,Z2>=33,AA2>=33,AB2>=33,AC2>=33),\"PASS\",\"----\")","v":"----"},{"$f":"IFERROR(IF(Y2>90,\"A+\",IF(Y2>80,\"A\",IF(Y2>70,\"B+\",IF(Y2>60,\"B\",IF(Y2>50,\"C+\",IF(Y2>40,\"C\",IF(Y2>=33,\"D\",\"E\"))))))),\"Abs\")","v":"E"},{"$f":"IFERROR(IF(Z2>90,\"A+\",IF(Z2>80,\"A\",IF(Z2>70,\"B+\",IF(Z2>60,\"B\",IF(Z2>50,\"C+\",IF(Z2>40,\"C\",IF(Z2>=33,\"D\",\"E\"))))))),\"Abs\")","v":"E"},{"$f":"IFERROR(IF(AA2>90,\"A+\",IF(AA2>80,\"A\",IF(AA2>70,\"B+\",IF(AA2>60,\"B\",IF(AA2>50,\"C+\",IF(AA2>40,\"C\",IF(AA2>=33,\"D\",\"E\"))))))),\"Abs\")","v":"E"},{"$f":"IFERROR(IF(AB2>90,\"A+\",IF(AB2>80,\"A\",IF(AB2>70,\"B+\",IF(AB2>60,\"B\",IF(AB2>50,\"C+\",IF(AB2>40,\"C\",IF(AB2>=33,\"D\",\"E\"))))))),\"Abs\")","v":"E"},{"$f":"IFERROR(IF(AC2>90,\"A+\",IF(AC2>80,\"A\",IF(AC2>70,\"B+\",IF(AC2>60,\"B\",IF(AC2>50,\"C+\",IF(AC2>40,\"C\",IF(AC2>=33,\"D\",\"E\"))))))),\"Abs\")","v":"E"},{"$f":"IFERROR(IF(AD2>90,\"A+\",IF(AD2>80,\"A\",IF(AD2>70,\"B+\",IF(AD2>60,\"B\",IF(AD2>50,\"C+\",IF(AD2>40,\"C\",IF(AD2>=33,\"D\",\"E\"))))))),\"--\")","v":"--"},null,null,null,null,null,{"$f":"Table_2[[#This Row],[Column51]]&Table_2[[#This Row],[Column52]]&AM4","v":""}]
[2,null,null,null,null,null,null,null,null,null,null,null,null,null,null,null,null,null,null,null,"--",{"$f":"IF(U3=\"--\",0,U3)","v":0},null,null,{"$f":"(K3/Instructions!$C$23)*100","v":0},{"$f":"(L3/Instructions!$C$24)*100","v":0},{"$f":"(M3/Instructions!$C$25)*100","v":0},{"$f":"(N3/Instructions!$C$26)*100","v":0},{"$f":"(O3/Instructions!$C$27)*100","v":0},{"$f":"(U3/'Report Card'!$H$22)*100","v":{"$error":"#VALUE!"}},{"$f":"IF(AND(Y3>=33,Z3>=33,AA3>=33,AB3>=33,AC3>=33),\"PASS\",\"----\")","v":"----"},"E","E","E","E","E",{"$f":"IFERROR(IF(AD3>90,\"A+\",IF(AD3>80,\"A\",IF(AD3>70,\"B+\",IF(AD3>60,\"B\",IF(AD3>50,\"C+\",IF(AD3>40,\"C\",IF(AD3>=33,\"D\",\"E\"))))))),\"--\")","v":"--"},null,null,null,null,null,{"$f":"Table_2[[#This Row],[Column51]]&Table_2[[#This Row],[Column52]]&AM5","v":""}]
[3,null,null,null,null,null,null,null,null,null,null,null,null,null,null,null,null,null,null,null,"--",0,null,null,{"$f":"(K4/Instructions!$C$23)*100","v":0},{"$f":"(L4/Instructions!$C$24)*100","v":0},{"$f":"(M4/Instructions!$C$25)*100","v":0},{"$f":"(N4/Instructions!$C$26)*100","v":0},{"$f":"(O4/Instructions!$C$27)*100","v":0},{"$f":"(U4/'Report Card'!$H$22)*100","v":{"$error":"#VALUE!"}},"----","E","E","E","E","E","--"]
[4,null,null,null,null,null,null,null,null,null,null,null,null,null,null,null,null,null,null,null,"--",0,null,null,{"$f":"(K5/Instructions!$C$23)*100","v":0},{"$f":"(L5/Instructions!$C$24)*100","v":0},{"$f":"(M5/Instructions!$C$25)*100","v":0},{"$f":"(N5/Instructions!$C$26)*100","v":0},{"$f":"(O5/Instructions!$C$27)*100","v":0},{"$f":"(U5/'Report Card'!$H$22)*100","v":{"$error":"#VALUE!"}},"----","E","E","E","E","E","--"]
[5,null,null,null,null,null,null,null,null,null,null,null,null,null,null,null,null,null,null,null,"--",0,null,null,{"$f":"(K6/Instructions!$C$23)*100","v":0},{"$f":"(L6/Instructions!$C$24)*100","v":0},{"$f":"(M6/Instructions!$C$25)*100","v":0},{"$f":"(N6/Instructions!$C$26)*100","v":0},{"$f":"(O6/Instructions!$C$27)*100","v":0},{"$f":"(U6/'Report Card'!$H$22)*100","v":{"$error":"#VALUE!"}},"----","E","E","E","E","E",{"$f":"IFERROR(IF(AD6>90,\"A+\",IF(AD6>80,\"A\",IF(AD6>70,\"B+\",IF(AD6>60,\"B\",IF(AD6>50,\"C+\",IF(AD6>40,\"C\",IF(AD6>=33,\"D\",\"E\"))))))),\"--\")","v":"--"}]
[6,null,null,null,null,null,null,null,null,null,null,null,null,null,null,null,null,null,null,null,"--",0,null,null,{"$f":"(K7/Instructions!$C$23)*100","v":0},{"$f":"(L7/Instructions!$C$24)*100","v":0},{"$f":"(M7/Instructions!$C$25)*100","v":0},{"$f":"(N7/Instructions!$C$26)*100","v":0},{"$f":"(O7/Instructions!$C$27)*100","v":0},{"$f":"(U7/'Report Card'!$H$22)*100","v":{"$error":"#VALUE!"}},"----","E","E","E","E","E","--"]
[7,null,null,null,null,null,null,null,null,null,null,null,null,null,null,null,null,null,null,null,"--",0,null,null,{"$f":"(K8/Instructions!$C$23)*100","v":0},{"$f":"(L8/Instructions!$C$24)*100","v":0},{"$f":"(M8/Instructions!$C$25)*100","v":0},{"$f":"(N8/Instructions!$C$26)*100","v":0},{"$f":"(O8/Instructions!$C$27)*100","v":0},{"$f":"(U8/'Report Card'!$H$22)*100","v":{"$error":"#VALUE!"}},"----","E","E","E","E","E","--"]
[8,null,null,null,null,null,null,null,null,null,null,null,null,null,null,null,null,null,null,null,"--",0,null,null,{"$f":"(K9/Instructions!$C$23)*100","v":0},{"$f":"(L9/Instructions!$C$24)*100","v":0},{"$f":"(M9/Instructions!$C$25)*100","v":0},{"$f":"(N9/Instructions!$C$26)*100","v":0},{"$f":"(O9/Instructions!$C$27)*100","v":0},{"$f":"(U9/'Report Card'!$H$22)*100","v":{"$error":"#VALUE!"}},"----","E","E","E","E","E","--"]
[9,null,null,null,null,null,null,null,null,null,null,null,null,null,null,null,null,null,null,null,"--",0,null,null,{"$f":"(K10/Instructions!$C$23)*100","v":0},{"$f":"(L10/Instructions!$C$24)*100","v":0},{"$f":"(M10/Instructions!$C$25)*100","v":0},{"$f":"(N10/Instructions!$C$26)*100","v":0},{"$f":"(O10/Instructions!$C$27)*100","v":0},{"$f":"(U10/'Report Card'!$H$22)*100","v":{"$error":"#VALUE!"}},"----","E","E","E","E","E","--"]
[10,null,null,null,null,null,null,null,null,null,null,null,null,null,null,null,null,null,null,null,"--",0,null,null,{"$f":"(K11/Instructions!$C$23)*100","v":0},{"$f":"(L11/Instructions!$C$24)*100","v":0},{"$f":"(M11/Instructions!$C$25)*100","v":0},{"$f":"(N11/Instructions!$C$26)*100","v":0},{"$f":"(O11/Instructions!$C$27)*100","v":0},{"$f":"(U11/'Report Card'!$H$22)*100","v":{"$error":"#VALUE!"}},"----","E","E","E","E","E","--"]
[11,null,null,null,null,null,null,null,null,null,null,null,null,null,null,null,null,null,null,null,"--",0,null,null,{"$f":"(K12/Instructions!$C$23)*100","v":0},{"$f":"(L12/Instructions!$C$24)*100","v":0},{"$f":"(M12/Instructions!$C$25)*100","v":0},{"$f":"(N12/Instructions!$C$26)*100","v":0},{"$f":"(O12/Instructions!$C$27)*100","v":0},{"$f":"(U12/'Report Card'!$H$22)*100","v":{"$error":"#VALUE!"}},"----","E","E","E","E","E","--"]
[12,null,null,null,null,null,null,null,null,null,null,null,null,null,null,null,null,null,null,null,"--",0,null,null,{"$f":"(K13/Instructions!$C$23)*100","v":0},{"$f":"(L13/Instructions!$C$24)*100","v":0},{"$f":"(M13/Instructions!$C$25)*100","v":0},{"$f":"(N13/Instructions!$C$26)*100","v":0},{"$f":"(O13/Instructions!$C$27)*100","v":0},{"$f":"(U13/'Report Card'!$H$22)*100","v":{"$error":"#VALUE!"}},"----","E","E","E","E","E","--",null,null,null,null,null,{"$f":"Table_2[[#This Row],[Column51]]&Table_2[[#This Row],[Column52]]&AM15","v":""}]
[13,null,null,null,null,null,null,null,null,null,null,null,null,null,null,null,null,null,null,null,"--",0,null,null,{"$f":"(K14/Instructions!$C$23)*100","v":0},{"$f":"(L14/Instructions!$C$24)*100","v":0},{"$f":"(M14/Instructions!$C$25)*100","v":0},{"$f":"(N14/Instructions!$C$26)*100","v":0},{"$f":"(O14/Instructions!$C$27)*100","v":0},{"$f":"(U14/'Report Card'!$H$22)*100","v":{"$error":"#VALUE!"}},"----","E","E","E","E","E","--",null,null,null,null,null,{"$f":"Table_2[[#This Row],[Column51]]&Table_2[[#This Row],[Column52]]&AM16","v":""}]
[14,null,null,null,null,null,null,null,null,null,null,null,null,null,null,null,null,null,null,null,"--",0,null,null,{"$f":"(K15/Instructions!$C$23)*100","v":0},{"$f":"(L15/Instructions!$C$24)*100","v":0},{"$f":"(M15/Instructions!$C$25)*100","v":0},{"$f":"(N15/Instructions!$C$26)*100","v":0},{"$f":"(O15/Instructions!$C$27)*100","v":0},{"$f":"(U15/'Report Card'!$H$22)*100","v":{"$error":"#VALUE!"}},"----","E","E","E","E","E","--",null,null,null,null,null,{"$f":"Table_2[[#This Row],[Column51]]&Table_2[[#This Row],[Column52]]&AM17","v":""}]
[15,null,null,null,null,null,null,null,null,null,null,null,null,null,null,null,null,null,null,null,"--",0,null,null,{"$f":"(K16/Instructions!$C$23)*100","v":0},{"$f":"(L16/Instructions!$C$24)*100","v":0},{"$f":"(M16/Instructions!$C$25)*100","v":0},{"$f":"(N16/Instructions!$C$26)*100","v":0},{"$f":"(O16/Instructions!$C$27)*100","v":0},{"$f":"(U16/'Report Card'!$H$22)*100","v":{"$error":"#VALUE!"}},"----","E","E","E","E","E","--",null,null,null,null,null,{"$f":"Table_2[[#This Row],[Column51]]&Table_2[[#This Row],[Column52]]&AM18","v":""}]
[16,null,null,null,null,null,null,null,null,null,null,null,null,null,null,null,null,null,null,null,"--",0,null,null,{"$f":"(K17/Instructions!$C$23)*100","v":0},{"$f":"(L17/Instructions!$C$24)*100","v":0},{"$f":"(M17/Instructions!$C$25)*100","v":0},{"$f":"(N17/Instructions!$C$26)*100","v":0},{"$f":"(O17/Instructions!$C$27)*100","v":0},{"$f":"(U17/'Report Card'!$H$22)*100","v":{"$error":"#VALUE!"}},"----","E","E","E","E","E","--",null,null,null,null,null,{"$f":"Table_2[[#This Row],[Column51]]&Table_2[[#This Row],[Column52]]&AM19","v":""}]
[17,null,null,null,null,null,null,null,null,null,null,null,null,null,null,null,null,null,null,null,"--",0,null,null,{"$f":"(K18/Instructions!$C$23)*100","v":0},{"$f":"(L18/Instructions!$C$24)*100","v":0},{"$f":"(M18/Instructions!$C$25)*100","v":0},{"$f":"(N18/Instructions!$C$26)*100","v":0},{"$f":"(O18/Instructions!$C$27)*100","v":0},{"$f":"(U18/'Report Card'!$H$22)*100","v":{"$error":"#VALUE!"}},"----","E","E","E","E","E","--",null,null,null,null,null,{"$f":"Table_2[[#This Row],[Column51]]&Table_2[[#This Row],[Column52]]&AM20","v":""}]
[18,null,null,null,null,null,null,null,null,null,null,null,null,null,null,null,null,null,null,null,"--",0,null,null,{"$f":"(K19/Instructions!$C$23)*100","v":0},{"$f":"(L19/Instructions!$C$24)*100","v":0},{"$f":"(M19/Instructions!$C$25)*100","v":0},{"$f":"(N19/Instructions!$C$26)*100","v":0},{"$f":"(O19/Instructions!$C$27)*100","v":0},{"$f":"(U19/'Report Card'!$H$22)*100","v":{"$error":"#VALUE!"}},"----","E","E","E","E","E","--",null,null,null,null,null,{"$f":"Table_2[[#This Row],[Column51]]&Table_2[[#This Row],[Column52]]&AM21","v":""}]
[19,null,null,null,null,null,null,null,null,null,null,null,null,null,null,null,null,null,null,null,"--",0,null,null,{"$f":"(K20/Instructions!$C$23)*100","v":0},{"$f":"(L20/Instructions!$C$24)*100","v":0},{"$f":"(M20/Instructions!$C$25)*100","v":0},{"$f":"(N20/Instructions!$C$26)*100","v":0},{"$f":"(O20/Instructions!$C$27)*100","v":0},{"$f":"(U20/'Report Card'!$H$22)*100","v":{"$error":"#VALUE!"}},"----","E","E","E","E","E","--",null,null,null,null,null,{"$f":"Table_2[[#This Row],[Column51]]&Table_2[[#This Row],[Column52]]&AM22","v":""}]
{"$rows_left_out":384}
{"sheet":"Report Card","index":2,"n_rows":35,"n_cols":20,"rows_kept":35,"cut":false,"hidden":false,"merged":[[20,2,20,5],[21,3,21,4],[21,5,21,6],[5,0,5,10],[32,2,32,4],[26,1,26,4],[27,1,27,4],[28,1,28,4],[26,5,26,8],[27,5,27,8],[28,5,28,8],[22,1,22,9],[25,5,25,8],[25,1,25,4],[24,1,24,8],[7,4,7,7],[8,4,8,7],[1,0,1,3],[11,4,11,7],[11,8,11,9],[15,2,15,5],[15,6,15,7],[9,4,9,7],[9,8,9,9],[10,4,10,7],[10,8,10,9],[11,1,11,3],[12,1,12,9],[13,1,13,9],[14,2,14,5],[14,6,14,7],[8,8,8,9],[34,8,34,10],[6,12,7,12],[9,1,9,3],[10,1,10,3],[7,1,7,3],[8,1,8,3],[16,2,16,5],[16,6,16,7],[17,2,17,5],[17,6,17,7],[18,2,18,5],[18,6,18,7],[19,2,19,5],[19,6,19,7],[20,6,20,7],[21,1,21,2]]}
[]
[{"$f":"\"        Serial No./\"&Q3&\"/\"&R3&\"/\"&N8","v":"        Serial No./March/2024/6"}]
[null,null,null,null,null,null,null,null,null,null,null,null,null,null,null,null,{"$f":"Instructions!C19","v":"March"},{"$f":"Instructions!B19","v":2024}]
[]
[null,null,null,null,null,null,null,null,null,null,null,null,"Total Number of Record",{"$f":"COUNTA('Marks Entry'!F:F)","v":1}]
[{"$f":"\"Report Card \"&Q3& \" - \"&R3","v":"Report Card March - 2024"}]
[null,null,null,null,null,null,null,null,null,null,null,null,"Sr No. of Record"]
[null,"Student Name        :",null,null,{"$f":"IFERROR(VLOOKUP($N$8,'Marks Entry'!$A$1:$AO$401,6,0),\"\")","v":0},null,null,null,null,null,null,null,null,6]
[null,"E-Punjab ID              :",null,null,{"$f":"IFERROR(VLOOKUP($N$8,'Marks Entry'!$A$1:$AO$401,5,0),\"\")","v":0},null,null,null,null,null,null,null,null,null,null,null,null,null,null,{"$f":"IFERROR(VLOOKUP($N$8,'Marks Entry'!$A$1:$AO$401,3,0),\"\")","v":0}]
[null,"Father’s Name       :",null,null,{"$f":"IFERROR(VLOOKUP($N$8,'Marks Entry'!$A$1:$AO$401,7,0),\"\")","v":0}]
[null,"Mother’s Name     :",null,null,{"$f":"IFERROR(VLOOKUP($N$8,'Marks Entry'!$A$1:$AO$401,8,0),\"\")","v":0}]
[null,"Class & Section      :",null,null,{"$f":"IFERROR(VLOOKUP($N$8,'Marks Entry'!$A$1:$AO$401,3,0)&\" \"&VLOOKUP($N$8,'Marks Entry'!$A$1:$AO$401,4,0),\"\")","v":" "}]
[null,{"$f":"\"has secured subject wise marks and grade as mentioned below in School Examination held in \" & Q3 & \"  \"&R3","v":"has secured subject wise marks and grade as mentioned below in School Examination held in March  2024"}]
[]
[null,"Sr. no.","Subject Name",null,null,null,"Total Marks",null,"Marks Obtained","Grade"]
[null,1,"PUNJABI",null,null,null,{"$f":"Instructions!C23","v":100},null,{"$f":"IFERROR(VLOOKUP($N$8,'Marks Entry'!$A$1:$AO$401,11,0),\"\")","v":0},{"$f":"IFERROR(VLOOKUP($N$8,'Marks Entry'!$A$1:$AO$401,32,0),\"\")","v":"E"}]
[null,2,"ENGLISH",null,null,null,{"$f":"Instructions!C24","v":100},null,{"$f":"IFERROR(VLOOKUP($N$8,'Marks Entry'!$A$1:$AO$401,12,0),\"\")","v":0},{"$f":"IFERROR(VLOOKUP($N$8,'Marks Entry'!$A$1:$AO$401,33,0),\"\")","v":"E"}]
[null,3,"MATHEMATICS",null,null,null,{"$f":"Instructions!C25","v":100},null,{"$f":"IFERROR(VLOOKUP($N$8,'Marks Entry'!$A$1:$AO$401,13,0),\"\")","v":0},{"$f":"IFERROR(VLOOKUP($N$8,'Marks Entry'!$A$1:$AO$401,34,0),\"\")","v":"E"}]
[null,{"$f":"IF(OR(T9=\"5th\",T9=\"4th\",T9=\"3rd\"),4,\"\")","v":""},{"$f":"IF(OR(T9=\"5th\",T9=\"4th\",T9=\"3rd\"),\"ENVIRONMENT EDUCATION\",\"\")","v":""},null,null,null,{"$f":"IF(B19=4,Instructions!C26,\"\")","v":""},null,{"$f":"IFERROR(IF(B19=4,(VLOOKUP($N$8,'Marks Entry'!$A$1:$AO$401,14,0)),\"\"),\"\")","v":""},{"$f":"IFERROR(IF(B19=4,(VLOOKUP($N$8,'Marks Entry'!$A$1:$AO$401,35,0)),\"\"),\"\")","v":""}]
[null,{"$f":"IF(OR(T9=\"5th\",T9=\"4th\"),5,\"\")","v":""},{"$f":"IF(OR(T9=\"5th\",T9=\"4th\"),\"HINDI\",\"\")","v":""},null,null,null,{"$f":"IF(B20=5,Instructions!C27,\"\")","v":""},null,{"$f":"IFERROR(IF(B20=5,(VLOOKUP($N$8,'Marks Entry'!$A$1:$AO$401,15,0)),\"\"),\"\")","v":""},{"$f":"IFERROR(IF(B20=5,(VLOOKUP($N$8,'Marks Entry'!$A$1:$AO$401,36,0)),\"\"),\"\")","v":""}]
{"$rows_left_out":16}
{"sheet":"Abstract","index":3,"n_rows":14,"n_cols":16,"rows_kept":14,"cut":false,"hidden":false,"merged":[[0,0,0,10],[0,13,0,15],[13,1,13,4]]}
["Subject & Grade Wise  Students Counts Details",null,null,null,null,null,null,null,null,null,null,null,null,{"$f":"\"Topper of Class \"&B2","v":"Topper of Class 2nd"}]
["Class","2nd","Section","A",null,null,null,null,null,null,null,null,null,"Rank","Student Name","Marks"]
["Grade/Subject","Punjabi ","English","Hindi","Maths.","Science",null,null,null,null,null,null,null,1,"ASHOK",500]
["A+",{"$f":"COUNTIFS('Marks Entry'!$C:$C,$B$2,'Marks Entry'!$D:$D,$D$2,'Marks Entry'!AF:AF,$A4)","v":0},{"$f":"COUNTIFS('Marks Entry'!$C:$C,$B$2,'Marks Entry'!$D:$D,$D$2,'Marks Entry'!AG:AG,$A4)","v":0},{"$f":"COUNTIFS('Marks Entry'!$C:$C,$B$2,'Marks Entry'!$D:$D,$D$2,'Marks Entry'!AH:AH,$A4)","v":0},{"$f":"COUNTIFS('Marks Entry'!$C:$C,$B$2,'Marks Entry'!$D:$D,$D$2,'Marks Entry'!AI:AI,$A4)","v":0},{"$f":"COUNTIFS('Marks Entry'!$C:$C,$B$2,'Marks Entry'!$D:$D,$D$2,'Marks Entry'!AJ:AJ,$A4)","v":0},null,null,null,null,null,null,null,2,"CHAMAN",500]
["A",{"$f":"COUNTIFS('Marks Entry'!$C:$C,$B$2,'Marks Entry'!$D:$D,$D$2,'Marks Entry'!AF:AF,$A5)","v":0},{"$f":"COUNTIFS('Marks Entry'!$C:$C,$B$2,'Marks Entry'!$D:$D,$D$2,'Marks Entry'!AG:AG,$A5)","v":0},{"$f":"COUNTIFS('Marks Entry'!$C:$C,$B$2,'Marks Entry'!$D:$D,$D$2,'Marks Entry'!AH:AH,$A5)","v":0},{"$f":"COUNTIFS('Marks Entry'!$C:$C,$B$2,'Marks Entry'!$D:$D,$D$2,'Marks Entry'!AI:AI,$A5)","v":0},{"$f":"COUNTIFS('Marks Entry'!$C:$C,$B$2,'Marks Entry'!$D:$D,$D$2,'Marks Entry'!AJ:AJ,$A5)","v":0},null,null,null,null,null,null,null,3,"ARIF",499]
["B+",{"$f":"COUNTIFS('Marks Entry'!$C:$C,$B$2,'Marks Entry'!$D:$D,$D$2,'Marks Entry'!AF:AF,$A6)","v":0},{"$f":"COUNTIFS('Marks Entry'!$C:$C,$B$2,'Marks Entry'!$D:$D,$D$2,'Marks Entry'!AG:AG,$A6)","v":0},{"$f":"COUNTIFS('Marks Entry'!$C:$C,$B$2,'Marks Entry'!$D:$D,$D$2,'Marks Entry'!AH:AH,$A6)","v":0},{"$f":"COUNTIFS('Marks Entry'!$C:$C,$B$2,'Marks Entry'!$D:$D,$D$2,'Marks Entry'!AI:AI,$A6)","v":0},{"$f":"COUNTIFS('Marks Entry'!$C:$C,$B$2,'Marks Entry'!$D:$D,$D$2,'Marks Entry'!AJ:AJ,$A6)","v":0},null,null,null,null,null,null,null,4,"KAJAL",488]
["B",{"$f":"COUNTIFS('Marks Entry'!$C:$C,$B$2,'Marks Entry'!$D:$D,$D$2,'Marks Entry'!AF:AF,$A7)","v":0},{"$f":"COUNTIFS('Marks Entry'!$C:$C,$B$2,'Marks Entry'!$D:$D,$D$2,'Marks Entry'!AG:AG,$A7)","v":0},{"$f":"COUNTIFS('Marks Entry'!$C:$C,$B$2,'Marks Entry'!$D:$D,$D$2,'Marks Entry'!AH:AH,$A7)","v":0},{"$f":"COUNTIFS('Marks Entry'!$C:$C,$B$2,'Marks Entry'!$D:$D,$D$2,'Marks Entry'!AI:AI,$A7)","v":0},{"$f":"COUNTIFS('Marks Entry'!$C:$C,$B$2,'Marks Entry'!$D:$D,$D$2,'Marks Entry'!AJ:AJ,$A7)","v":0},null,null,null,null,null,null,null,5,"GUDIA",483]
["C+",{"$f":"COUNTIFS('Marks Entry'!$C:$C,$B$2,'Marks Entry'!$D:$D,$D$2,'Marks Entry'!AF:AF,$A8)","v":0},{"$f":"COUNTIFS('Marks Entry'!$C:$C,$B$2,'Marks Entry'!$D:$D,$D$2,'Marks Entry'!AG:AG,$A8)","v":0},{"$f":"COUNTIFS('Marks Entry'!$C:$C,$B$2,'Marks Entry'!$D:$D,$D$2,'Marks Entry'!AH:AH,$A8)","v":0},{"$f":"COUNTIFS('Marks Entry'!$C:$C,$B$2,'Marks Entry'!$D:$D,$D$2,'Marks Entry'!AI:AI,$A8)","v":0},{"$f":"COUNTIFS('Marks Entry'!$C:$C,$B$2,'Marks Entry'!$D:$D,$D$2,'Marks Entry'!AJ:AJ,$A8)","v":0}]
["C",{"$f":"COUNTIFS('Marks Entry'!$C:$C,$B$2,'Marks Entry'!$D:$D,$D$2,'Marks Entry'!AF:AF,$A9)","v":0},{"$f":"COUNTIFS('Marks Entry'!$C:$C,$B$2,'Marks Entry'!$D:$D,$D$2,'Marks Entry'!AG:AG,$A9)","v":0},{"$f":"COUNTIFS('Marks Entry'!$C:$C,$B$2,'Marks Entry'!$D:$D,$D$2,'Marks Entry'!AH:AH,$A9)","v":0},{"$f":"COUNTIFS('Marks Entry'!$C:$C,$B$2,'Marks Entry'!$D:$D,$D$2,'Marks Entry'!AI:AI,$A9)","v":0},{"$f":"COUNTIFS('Marks Entry'!$C:$C,$B$2,'Marks Entry'!$D:$D,$D$2,'Marks Entry'!AJ:AJ,$A9)","v":0}]
["D",{"$f":"COUNTIFS('Marks Entry'!$C:$C,$B$2,'Marks Entry'!$D:$D,$D$2,'Marks Entry'!AF:AF,$A10)","v":0},{"$f":"COUNTIFS('Marks Entry'!$C:$C,$B$2,'Marks Entry'!$D:$D,$D$2,'Marks Entry'!AG:AG,$A10)","v":0},{"$f":"COUNTIFS('Marks Entry'!$C:$C,$B$2,'Marks Entry'!$D:$D,$D$2,'Marks Entry'!AH:AH,$A10)","v":0},{"$f":"COUNTIFS('Marks Entry'!$C:$C,$B$2,'Marks Entry'!$D:$D,$D$2,'Marks Entry'!AI:AI,$A10)","v":0},{"$f":"COUNTIFS('Marks Entry'!$C:$C,$B$2,'Marks Entry'!$D:$D,$D$2,'Marks Entry'!AJ:AJ,$A10)","v":0}]
["E",{"$f":"COUNTIFS('Marks Entry'!$C:$C,$B$2,'Marks Entry'!$D:$D,$D$2,'Marks Entry'!AF:AF,$A11)","v":0},{"$f":"COUNTIFS('Marks Entry'!$C:$C,$B$2,'Marks Entry'!$D:$D,$D$2,'Marks Entry'!AG:AG,$A11)","v":0},{"$f":"COUNTIFS('Marks Entry'!$C:$C,$B$2,'Marks Entry'!$D:$D,$D$2,'Marks Entry'!AH:AH,$A11)","v":0},{"$f":"COUNTIFS('Marks Entry'!$C:$C,$B$2,'Marks Entry'!$D:$D,$D$2,'Marks Entry'!AI:AI,$A11)","v":0},{"$f":"COUNTIFS('Marks Entry'!$C:$C,$B$2,'Marks Entry'!$D:$D,$D$2,'Marks Entry'!AJ:AJ,$A11)","v":0}]
["Total Student",{"$f":"SUM(B4:B11)","v":0},{"$f":"SUM(C4:C11)","v":0},0,0,0]
[]
[null,"Total Fail/Reappear Students ",null,null,null,{"$f":"COUNTIFS('Marks Entry'!C2:C500,B2,'Marks Entry'!V2:V500,0)","v":0}]