{"text_format":"1","workbook":"xlsx","n_sheets":4,"sheets":["Instructions","Marks Entry","Report Card","Abstract"],"not_rendered":{"charts":1,"images":1,"macros":1,"external_links":1,"defined_names":3,"comments":0,"pivot_tables":0},"unopened":[],"bounds":{"document_bytes":16777216,"sheet_cells":100000,"rows_first":2000,"rows_last":500,"rows_between":2000,"halvings":0,"cell_chars":16384,"cell_head_chars":4096},"cells_cut":0,"cells_raw":0,"read":"whole","date_system":"1900"}

{"sheet":"Instructions","index":0,"n_rows":33,"n_cols":12,"rows_kept":33,"cut":false,"hidden":false,"merged":[[0,0,0,5],[16,1,16,2],[21,1,21,2],[8,1,8,4],[3,1,3,2],[4,1,4,5],[9,1,9,4],[6,1,6,6],[7,1,7,6]]}
["Instructions",null,null,null,null,null,null,null,null,null,"Year","Month"]
["Kindly read All Instructions before Use Report Card Utitly",null,null,null,null,null,null,null,null,null,2022,"Sept"]
[null,null,null,null,null,null,null,null,null,null,2023,"March"]
[1,"First Fill  Necessary Data for report card by click on ",null,"Fill Data",null,null,null,null,null,null,2024]
[2,"In All Sheet Use only or Click on  Yellow coloured Filled  Cell to Enter or Select Data. Rest Cells Are Locked",null,null,null,null,null,null,null,null,2025]
[3,"Now Goto Marks Entry Sheet . Then Enter Data ( Marks) in Yellow cell thier",null,null,null,null,null,null,null,null,2026]
[4,"Enter Subjects Total Marks for Each Subject in this sheet at Row no . 20 onwards",null,null,null,null,null,null,null,null,2027]
[5,"You can find Grade Wise , Class Wise , Subject Wise Students count and Topper List",null,null,null,null,null,null,null,null,2028]
[6,"you can copy Paste Students Data Like Name ,Father Name, Class Etc.  From Epunjab Student Report Excel File",null,null,null,null,null,null,null,null,2029]
[7,"After Entered All data in yellow cell of Marks Entry 6-8 Sheet . Goto Report Card to View/Print report card of each Students",null,null,null,null,null,null,null,null,2030]
[]
[]
[]
[]
[]
[]
[null,"Select to  Fill Data"]
[null,"Select Year Below","Select Month"]
[null,2024,"March"]
[null,"Enter Date of Report Card Preparation","2024-03-31"]
[]
[null,"Enter Maximum Subject Marks"]
[null,"PUNJABI",100]
[null,"ENGLISH",100]
[null,"HINDI",100]
[null,"MATHEMATICS",100]
[null,"ENVIRONMENT EDUCATION",100]
[]
[]
[]
[null,null,null,null,{"$f":"UPPER(B31)","v":""}]
[]
[null,"Grand Total (Except Grading Subject)",{"$f":"SUM(C23:C28)","v":500}]

{"sheet":"Marks Entry","index":1,"n_rows":403,"n_cols":43,"rows_kept":403,"cut":false,"hidden":false,"merged":[]}
["Sno",null,"Class","Sec","Student ID","Name","FatherName","MotherName","DOB","Gender",{"$f":"Instructions!B23","v":"PUNJABI"},{"$f":"Instructions!B24","v":"ENGLISH"},{"$f":"Instructions!B25","v":"HINDI"},{"$f":"Instructions!B26","v":"MATHEMATICS"},{"$f":"Instructions!B27","v":"ENVIRONMENT EDUCATION"},null,null,null,null,null,"Total Marks ","Total w/o F",null,"Option",{"$f":"Table_2[[#This Row],[Column11]]","v":"PUNJABI"},{"$f":"Table_2[[#This Row],[Column12]]","v":"ENGLISH"},{"$f":"Table_2[[#This Row],[Column13]]","v":"HINDI"},{"$f":"Table_2[[#This Row],[Column14]]","v":"MATHEMATICS"},{"$f":"Table_2[[#This Row],[Column15]]","v":"ENVIRONMENT EDUCATION"},"Total %","Pass/Fail",{"$f":"Table_2[[#This Row],[Column11]]","v":"PUNJABI"},{"$f":"Table_2[[#This Row],[Column12]]","v":"ENGLISH"},{"$f":"Table_2[[#This Row],[Column13]]","v":"HINDI"},{"$f":"Table_2[[#This Row],[Column14]]","v":"MATHEMATICS"},{"$f":"Table_2[[#This Row],[Column15]]","v":"ENVIRONMENT EDUCATION"},"Grade total",null,"Dr/Ph Grade","Dr/phy Total marks",null,null,{"$f":"Table_2[[#This Row],[Column51]]&Table_2[[#This Row],[Column52]]&AM3","v":""}]
[1,null,"3rd",null,null,null,null,null,null,null,null,null,null,null,null,null,null,null,null,null,{"$f":"IF(MIN(Y2:AC2)>=33,SUM(K2:P2),\"--\")","v":"--"},{"$f":"IF(U2=\"--\",0,U2)","v":0},null,null,{"$f":"(K2/Instructions!$C$23)*100","v":0},{"$f":"(L2/Instructions!$C$24)*100","v":0},{"$f":"(M2/Instructions!$C$25)*100","v":0},{"$f":"(N2/Instructions!$C$26)*100","v":0},{"$f":"(O2/Instructions!$C$27)*100","v":0},{"$f":"(U2/'Report Card'!$H$22)*100","v":{"$error":"#VALUE!"}},{"$f":"IF(AND(Y2>=33,Z2>=33,AA2>=33,AB2>=33,AC2>=33),\"PASS\",\"----\")","v":"----"},{"$f":"IFERROR(IF(Y2>90,\"A+\",IF(Y2>80,\"A\",IF(Y2>70,\"B+\",IF(Y2>60,\"B\",IF(Y2>50,\"C+\",IF(Y2>40,\"C\",IF(Y2>=33,\"D\",\"E\"))))))),\"Abs\")","v":"E"},{"$f":"IFERROR(IF(Z2>90,\"A+\",IF(Z2>80,\"A\",IF(Z2>70,\"B+\",IF(Z2>60,\"B\",IF(Z2>50,\"C+\",IF(Z2>40,\"C\",IF(Z2>=33,\"D\",\"E\"))))))),\"Abs\")","v":"E"},{"$f":"IFERROR(IF(AA2>90,\"A+\",IF(AA2>80,\"A\",IF(AA2>70,\"B+\",IF(AA2>60,\"B\",IF(AA2>50,\"C+\",IF(AA2>40,\"C\",IF(AA2>=33,\"D\",\"E\"))))))),\"Abs\")","v":"E"},{"$f":"IFERROR(IF(AB2>90,\"A+\",IF(AB2>80,\"A\",IF(AB2>70,\"B+\",IF(AB2>60,\"B\",IF(AB2>50,\"C+\",IF(AB2>40,\"C\",IF(AB2>=33,\"D\",\"E\"))))))),\"Abs\")","v":"E"},{"$f":"IFERROR(IF(AC2>90,\"A+\",IF(AC2>80,\"A\",IF(AC2>70,\"B+\",IF(AC2>60,\"B\",IF(AC2>50,\"C+\",IF(AC2>40,\"C\",IF(AC2>=33,\"D\",\"E\"))))))),\"Abs\")","v":"E"},{"$f":"IFERROR(IF(AD2>90,\"A+\",IF(AD2>80,\"A\",IF(AD2>70,\"B+\",IF(AD2>60,\"B\",IF(AD2>50,\"C+\",IF(AD2>40,\"C\",IF(AD2>=33,\"D\",\"E\"))))))),\"--\")","v":"--"},null,null,null,null,null,{"$f":"Table_2[[#This Row],[Column51]]&Table_2[[#This Row],[Column52]]&AM4","v":""}]
[2,null,null,null,null,null,null,null,null,null,null,null,null,null,null,null,null,null,null,null,"--",{"$f":"IF(U3=\"--\",0,U3)","v":0},null,null,{"$f":"(K3/Instructions!$C$23)*100","v":0},{"$f":"(L3/Instructions!$C$24)*100","v":0},{"$f":"(M3/Instructions!$C$25)*100","v":0},{"$f":"(N3/Instructions!$C$26)*100","v":0},{"$f":"(O3/Instructions!$C$27)*100","v":0},{"$f":"(U3/'Report Card'!$H$22)*100","v":{"$error":"#VALUE!"}},{"$f":"IF(AND(Y3>=33,Z3>=33,AA3>=33,AB3>=33,AC3>=33),\"PASS\",\"----\")","v":"----"},"E","E","E","E","E",{"$f":"IFERROR(IF(AD3>90,\"A+\",IF(AD3>80,\"A\",IF(AD3>70,\"B+\",IF(AD3>60,\"B\",IF(AD3>50,\"C+\",IF(AD3>40,\"C\",IF(AD3>=33,\"D\",\"E\"))))))),\"--\")","v":"--"},null,null,null,null,null,{"$f":"Table_2[[#This Row],[Column51]]&Table_2[[#This Row],[Column52]]&AM5","v":""}]
[3,null,null,null,null,null,null,null,null,null,null,null,null,null,null,null,null,null,null,null,"--",0,null,null,{"$f":"(K4/Instructions!$C$23)*100","v":0},{"$f":"(L4/Instructions!$C$24)*100","v":0},{"$f":"(M4/Instructions!$C$25)*100","v":0},{"$f":"(N4/Instructions!$C$26)*100","v":0},{"$f":"(O4/Instructions!$C$27)*100","v":0},{"$f":"(U4/'Report Card'!$H$22)*100","v":{"$error":"#VALUE!"}},"----","E","E","E","E","E","--"]
[4,null,null,null,null,null,null,null,null,null,null,null,null,null,null,null,null,null,null,null,"--",0,null,null,{"$f":"(K5/Instructions!$C$23)*100","v":0},{"$f":"(L5/Instructions!$C$24)*100","v":0},{"$f":"(M5/Instructions!$C$25)*100","v":0},{"$f":"(N5/Instructions!$C$26)*100","v":0},{"$f":"(O5/Instructions!$C$27)*100","v":0},{"$f":"(U5/'Report Card'!$H$22)*100","v":{"$error":"#VALUE!"}},"----","E","E","E","E","E","--"]
[5,null,null,null,null,null,null,null,null,null,null,null,null,null,null,null,null,null,null,null,"--",0,null,null,{"$f":"(K6/Instructions!$C$23)*100","v":0},{"$f":"(L6/Instructions!$C$24)*100","v":0},{"$f":"(M6/Instructions!$C$25)*100","v":0},{"$f":"(N6/Instructions!$C$26)*100","v":0},{"$f":"(O6/Instructions!$C$27)*100","v":0},{"$f":"(U6/'Report Card'!$H$22)*100","v":{"$error":"#VALUE!"}},"----","E","E","E","E","E",{"$f":"IFERROR(IF(AD6>90,\"A+\",IF(AD6>80,\"A\",IF(AD6>70,\"B+\",IF(AD6>60,\"B\",IF(AD6>50,\"C+\",IF(AD6>40,\"C\",IF(AD6>=33,\"D\",\"E\"))))))),\"--\")","v":"--"}]
[6,null,null,null,null,null,null,null,null,null,null,null,null,null,null,null,null,null,null,null,"--",0,null,null,{"$f":"(K7/Instructions!$C$23)*100","v":0},{"$f":"(L7/Instructions!$C$24)*100","v":0},{"$f":"(M7/Instructions!$C$25)*100","v":0},{"$f":"(N7/Instructions!$C$26)*100","v":0},{"$f":"(O7/Instructions!$C$27)*100","v":0},{"$f":"(U7/'Report Card'!$H$22)*100","v":{"$error":"#VALUE!"}},"----","E","E","E","E","E","--"]
[7,null,null,null,null,null,null,null,null,null,null,null,null,null,null,null,null,null,null,null,"--",0,null,null,{"$f":"(K8/Instructions!$C$23)*100","v":0},{"$f":"(L8/Instructions!$C$24)*100","v":0},{"$f":"(M8/Instructions!$C$25)*100","v":0},{"$f":"(N8/Instructions!$C$26)*100","v":0},{"$f":"(O8/Instructions!$C$27)*100","v":0},{"$f":"(U8/'Report Card'!$H$22)*100","v":{"$error":"#VALUE!"}},"----","E","E","E","E","E","--"]
[8,null,null,null,null,null,null,null,null,null,null,null,null,null,null,null,null,null,null,null,"--",0,null,null,{"$f":"(K9/Instructions!$C$23)*100","v":0},{"$f":"(L9/Instructions!$C$24)*100","v":0},{"$f":"(M9/Instructions!$C$25)*100","v":0},{"$f":"(N9/Instructions!$C$26)*100","v":0},{"$f":"(O9/Instructions!$C$27)*100","v":0},{"$f":"(U9/'Report Card'!$H$22)*100","v":{"$error":"#VALUE!"}},"----","E","E","E","E","E","--"]
[9,null,null,null,null,null,null,null,null,null,null,null,null,null,null,null,null,null,null,null,"--",0,null,null,{"$f":"(K10/Instructions!$C$23)*100","v":0},{"$f":"(L10/Instructions!$C$24)*100","v":0},{"$f":"(M10/Instructions!$C$25)*100","v":0},{"$f":"(N10/Instructions!$C$26)*100","v":0},{"$f":"(O10/Instructions!$C$27)*100","v":0},{"$f":"(U10/'Report Card'!$H$22)*100","v":{"$error":"#VALUE!"}},"----","E","E","E","E","E","--"]
[10,null,null,null,null,null,null,null,null,null,null,null,null,null,null,null,null,null,null,null,"--",0,null,null,{"$f":"(K11/Instructions!$C$23)*100","v":0},{"$f":"(L11/Instructions!$C$24)*100","v":0},{"$f":"(M11/Instructions!$C$25)*100","v":0},{"$f":"(N11/Instructions!$C$26)*100","v":0},{"$f":"(O11/Instructions!$C$27)*100","v":0},{"$f":"(U11/'Report Card'!$H$22)*100","v":{"$error":"#VALUE!"}},"----","E","E","E","E","E","--"]
[11,null,null,null,null,null,null,null,null,null,null,null,null,null,null,null,null,null,null,null,"--",0,null,null,{"$f":"(K12/Instructions!$C$23)*100","v":0},{"$f":"(L12/Instructions!$C$24)*100","v":0},{"$f":"(M12/Instructions!$C$25)*100","v":0},{"$f":"(N12/Instructions!$C$26)*100","v":0},{"$f":"(O12/Instructions!$C$27)*100","v":0},{"$f":"(U12/'Report Card'!$H$22)*100","v":{"$error":"#VALUE!"}},"----","E","E","E","E","E","--"]
[12,null,null,null,null,null,null,null,null,null,null,null,null,null,null,null,null,null,null,null,"--",0,null,null,{"$f":"(K13/Instructions!$C$23)*100","v":0},{"$f":"(L13/Instructions!$C$24)*100","v":0},{"$f":"(M13/Instructions!$C$25)*100","v":0},{"$f":"(N13/Instructions!$C$26)*100","v":0},{"$f":"(O13/Instructions!$C$27)*100","v":0},{"$f":"(U13/'Report Card'!$H$22)*100","v":{"$error":"#VALUE!"}},"----","E","E","E","E","E","--",null,null,null,null,null,{"$f":"Table_2[[#This Row],[Column51]]&Table_2[[#This Row],[Column52]]&AM15","v":""}]
[13,null,null,null,null,null,null,null,null,null,null,null,null,null,null,null,null,null,null,null,"--",0,null,null,{"$f":"(K14/Instructions!$C$23)*100","v":0},{"$f":"(L14/Instructions!$C$24)*100","v":0},{"$f":"(M14/Instructions!$C$25)*100","v":0},{"$f":"(N14/Instructions!$C$26)*100","v":0},{"$f":"(O14/Instructions!$C$27)*100","v":0},{"$f":"(U14/'Report Card'!$H$22)*100","v":{"$error":"#VALUE!"}},"----","E","E","E","E","E","--",null,null,null,null,null,{"$f":"Table_2[[#This Row],[Column51]]&Table_2[[#This Row],[Column52]]&AM16","v":""}]
[14,null,null,null,null,null,null,null,null,null,null,null,null,null,null,null,null,null,null,null,"--",0,null,null,{"$f":"(K15/Instructions!$C$23)*100","v":0},{"$f":"(L15/Instructions!$C$24)*100","v":0},{"$f":"(M15/Instructions!$C$25)*100","v":0},{"$f":"(N15/Instructions!$C$26)*100","v":0},{"$f":"(O15/Instructions!$C$27)*100","v":0},{"$f":"(U15/'Report Card'!$H$22)*100","v":{"$error":"#VALUE!"}},"----","E","E","E","E","E","--",null,null,null,null,null,{"$f":"Table_2[[#This Row],[Column51]]&Table_2[[#This Row],[Column52]]&AM17","v":""}]
[15,null,null,null,null,null,null,null,null,null,null,null,null,null,null,null,null,null,null,null,"--",0,null,null,{"$f":"(K16/Instructions!$C$23)*100","v":0},{"$f":"(L16/Instructions!$C$24)*100","v":0},{"$f":"(M16/Instructions!$C$25)*100","v":0},{"$f":"(N16/Instructions!$C$26)*100","v":0},{"$f":"(O16/Instructions!$C$27)*100","v":0},{"$f":"(U16/'Report Card'!$H$22)*100","v":{"$error":"#VALUE!"}},"----","E","E","E","E","E","--",null,null,null,null,null,{"$f":"Table_2[[#This Row],[Column51]]&Table_2[[#This Row],[Column52]]&AM18","v":""}]
[16,null,null,null,null,null,null,null,null,null,null,null,null,null,null,null,null,null,null,null,"--",0,null,null,{"$f":"(K17/Instructions!$C$23)*100","v":0},{"$f":"(L17/Instructions!$C$24)*100","v":0},{"$f":"(M17/Instructions!$C$25)*100","v":0},{"$f":"(N17/Instructions!$C$26)*100","v":0},{"$f":"(O17/Instructions!$C$27)*100","v":0},{"$f":"(U17/'Report Card'!$H$22)*100","v":{"$error":"#VALUE!"}},"----","E","E","E","E","E","--",null,null,null,null,null,{"$f":"Table_2[[#This Row],[Column51]]&Table_2[[#This Row],[Column52]]&AM19","v":""}]
[17,null,null,null,null,null,null,null,null,null,null,null,null,null,null,null,null,null,null,null,"--",0,null,null,{"$f":"(K18/Instructions!$C$23)*100","v":0},{"$f":"(L18/Instructions!$C$24)*100","v":0},{"$f":"(M18/Instructions!$C$25)*100","v":0},{"$f":"(N18/Instructions!$C$26)*100","v":0},{"$f":"(O18/Instructions!$C$27)*100","v":0},{"$f":"(U18/'Report Card'!$H$22)*100","v":{"$error":"#VALUE!"}},"----","E","E","E","E","E","--",null,null,null,null,null,{"$f":"Table_2[[#This Row],[Column51]]&Table_2[[#This Row],[Column52]]&AM20","v":""}]
[18,null,null,null,null,null,null,null,null,null,null,null,null,null,null,null,null,null,null,null,"--",0,null,null,{"$f":"(K19/Instructions!$C$23)*100","v":0},{"$f":"(L19/Instructions!$C$24)*100","v":0},{"$f":"(M19/Instructions!$C$25)*100","v":0},{"$f":"(N19/Instructions!$C$26)*100","v":0},{"$f":"(O19/Instructions!$C$27)*100","v":0},{"$f":"(U19/'Report Card'!$H$22)*100","v":{"$error":"#VALUE!"}},"----","E","E","E","E","E","--",null,null,null,null,null,{"$f":"Table_2[[#This Row],[Column51]]&Table_2[[#This Row],[Column52]]&AM21","v":""}]
[19,null,null,null,null,null,null,null,null,null,null,null,null,null,null,null,null,null,null,null,"--",0,null,null,{"$f":"(K20/Instructions!$C$23)*100","v":0},{"$f":"(L20/Instructions!$C$24)*100","v":0},{"$f":"(M20/Instructions!$C$25)*100","v":0},{"$f":"(N20/Instructions!$C$26)*100","v":0},{"$f":"(O20/Instructions!$C$27)*100","v":0},{"$f":"(U20/'Report Card'!$H$22)*100","v":{"$error":"#VALUE!"}},"----","E","E","E","E","E","--",null,null,null,null,null,{"$f":"Table_2[[#This Row],[Column51]]&Table_2[[#This Row],[Column52]]&AM22","v":""}]
[20,null,null,null,null,null,null,null,null,null,null,null,null,null,null,null,null,null,null,null,"--",0,null,null,{"$f":"(K21/Instructions!$C$23)*100","v":0},{"$f":"(L21/Instructions!$C$24)*100","v":0},{"$f":"(M21/Instructions!$C$25)*100","v":0},{"$f":"(N21/Instructions!$C$26)*100","v":0},{"$f":"(O21/Instructions!$C$27)*100","v":0},{"$f":"(U21/'Report Card'!$H$22)*100","v":{"$error":"#VALUE!"}},"----","E","E","E","E","E","--",null,null,null,null,null,{"$f":"Table_2[[#This Row],[Column51]]&Table_2[[#This Row],[Column52]]&AM23","v":""}]
[21,null,null,null,null,null,null,null,null,null,null,null,null,null,null,null,null,null,null,null,"--",0,null,null,{"$f":"(K22/Instructions!$C$23)*100","v":0},{"$f":"(L22/Instructions!$C$24)*100","v":0},{"$f":"(M22/Instructions!$C$25)*100","v":0},{"$f":"(N22/Instructions!$C$26)*100","v":0},{"$f":"(O22/Instructions!$C$27)*100","v":0},{"$f":"(U22/'Report Card'!$H$22)*100","v":{"$error":"#VALUE!"}},"----","E","E","E","E","E","--",null,null,null,null,null,{"$f":"Table_2[[#This Row],[Column51]]&Table_2[[#This Row],[Column52]]&AM24","v":""}]
[22,null,null,null,null,null,null,null,null,null,null,null,null,null,null,null,null,null,null,null,"--",0,null,null,{"$f":"(K23/Instructions!$C$23)*100","v":0},{"$f":"(L23/Instructions!$C$24)*100","v":0},{"$f":"(M23/Instructions!$C$25)*100","v":0},{"$f":"(N23/Instructions!$C$26)*100","v":0},{"$f":"(O23/Instructions!$C$27)*100","v":0},{"$f":"(U23/'Report Card'!$H$22)*100","v":{"$error":"#VALUE!"}},"----","E","E","E","E","E","--",null,null,null,null,null,{"$f":"Table_2[[#This Row],[Column51]]&Table_2[[#This Row],[Column52]]&AM25","v":""}]
[23,null,null,null,null,null,null,null,null,null,null,null,null,null,null,null,null,null,null,null,"--",0,null,null,{"$f":"(K24/Instructions!$C$23)*100","v":0},{"$f":"(L24/Instructions!$C$24)*100","v":0},{"$f":"(M24/Instructions!$C$25)*100","v":0},{"$f":"(N24/Instructions!$C$26)*100","v":0},{"$f":"(O24/Instructions!$C$27)*100","v":0},{"$f":"(U24/'Report Card'!$H$22)*100","v":{"$error":"#VALUE!"}},"----","E","E","E","E","E","--",null,null,null,null,null,{"$f":"Table_2[[#This Row],[Column51]]&Table_2[[#This Row],[Column52]]&AM26","v":""}]
[24,null,null,null,null,null,null,null,null,null,null,null,null,null,null,null,null,null,null,null,"--",0,null,null,{"$f":"(K25/Instructions!$C$23)*100","v":0},{"$f":"(L25/Instructions!$C$24)*100","v":0},{"$f":"(M25/Instructions!$C$25)*100","v":0},{"$f":"(N25/Instructions!$C$26)*100","v":0},{"$f":"(O25/Instructions!$C$27)*100","v":0},{"$f":"(U25/'Report Card'!$H$22)*100","v":{"$error":"#VALUE!"}},"----","E","E","E","E","E","--",null,null,null,null,null,{"$f":"Table_2[[#This Row],[Column51]]&Table_2[[#This Row],[Column52]]&AM27","v":""}]
[25,null,null,null,null,null,null,null,null,null,null,null,null,null,null,null,null,null,null,null,"--",0,null,null,{"$f":"(K26/Instructions!$C$23)*100","v":0},{"$f":"(L26/Instructions!$C$24)*100","v":0},{"$f":"(M26/Instructions!$C$25)*100","v":0},{"$f":"(N26/Instructions!$C$26)*100","v":0},{"$f":"(O26/Instructions!$C$27)*100","v":0},{"$f":"(U26/'Report Card'!$H$22)*100","v":{"$error":"#VALUE!"}},"----","E","E","E","E","E","--",null,null,null,null,null,{"$f":"Table_2[[#This Row],[Column51]]&Table_2[[#This Row],[Column52]]&AM28","v":""}]
[26,null,null,null,null,null,null,null,null,null,null,null,null,null,null,null,null,null,null,null,"--",0,null,null,{"$f":"(K27/Instructions!$C$23)*100","v":0},{"$f":"(L27/Instructions!$C$24)*100","v":0},{"$f":"(M27/Instructions!$C$25)*100","v":0},{"$f":"(N27/Instructions!$C$26)*100","v":0},{"$f":"(O27/Instructions!$C$27)*100","v":0},{"$f":"(U27/'Report Card'!$H$22)*100","v":{"$error":"#VALUE!"}},"----","E","E","E","E","E","--",null,null,null,null,null,{"$f":"Table_2[[#This Row],[Column51]]&Table_2[[#This Row],[Column52]]&AM29","v":""}]
[27,null,null,null,null,null,null,null,null,null,null,null,null,null,null,null,null,null,null,null,"--",0,null,null,{"$f":"(K28/Instructions!$C$23)*100","v":0},{"$f":"(L28/Instructions!$C$24)*100","v":0},{"$f":"(M28/Instructions!$C$25)*100","v":0},{"$f":"(N28/Instructions!$C$26)*100","v":0},{"$f":"(O28/Instructions!$C$27)*100","v":0},{"$f":"(U28/'Report Card'!$H$22)*100","v":{"$error":"#VALUE!"}},"----","E","E","E","E","E","--",null,null,null,null,null,{"$f":"Table_2[[#This Row],[Column51]]&Table_2[[#This Row],[Column52]]&AM30","v":""}]
[28,null,null,null,null,null,null,null,null,null,null,null,null,null,null,null,null,null,null,null,"--",0,null,null,{"$f":"(K29/Instructions!$C$23)*100","v":0},{"$f":"(L29/Instructions!$C$24)*100","v":0},{"$f":"(M29/Instructions!$C$25)*100","v":0},{"$f":"(N29/Instructions!$C$26)*100","v":0},{"$f":"(O29/Instructions!$C$27)*100","v":0},{"$f":"(U29/'Report Card'!$H$22)*100","v":{"$error":"#VALUE!"}},"----","E","E","E","E","E","--",null,null,null,null,null,{"$f":"Table_2[[#This Row],[Column51]]&Table_2[[#This Row],[Column52]]&AM31","v":""}]
[29,null,null,null,null,null,null,null,null,null,null,null,null,null,null,null,null,null,null,null,"--",0,null,null,{"$f":"(K30/Instructions!$C$23)*100","v":0},{"$f":"(L30/Instructions!$C$24)*100","v":0},{"$f":"(M30/Instructions!$C$25)*100","v":0},{"$f":"(N30/Instructions!$C$26)*100","v":0},{"$f":"(O30/Instructions!$C$27)*100","v":0},{"$f":"(U30/'Report Card'!$H$22)*100","v":{"$error":"#VALUE!"}},"----","E","E","E","E","E","--",null,null,null,null,null,{"$f":"Table_2[[#This Row],[Column51]]&Table_2[[#This Row],[Column52]]&AM32","v":""}]
[30,null,null,null,null,null,null,null,null,null,null,null,null,null,null,null,null,null,null,null,"--",0,null,null,{"$f":"(K31/Instructions!$C$23)*100","v":0},{"$f":"(L31/Instructions!$C$24)*100","v":0},{"$f":"(M31/Instructions!$C$25)*100","v":0},{"$f":"(N31/Instructions!$C$26)*100","v":0},{"$f":"(O31/Instructions!$C$27)*100","v":0},{"$f":"(U31/'Report Card'!$H$22)*100","v":{"$error":"#VALUE!"}},"----","E","E","E","E","E","--",null,null,null,null,null,{"$f":"Table_2[[#This Row],[Column51]]&Table_2[[#This Row],[Column52]]&AM33","v":""}]
[31,null,null,null,null,null,null,null,null,null,null,null,null,null,null,null,null,null,null,null,"--",0,null,null,{"$f":"(K32/Instructions!$C$23)*100","v":0},{"$f":"(L32/Instructions!$C$24)*100","v":0},{"$f":"(M32/Instructions!$C$25)*100","v":0},{"$f":"(N32/Instructions!$C$26)*100","v":0},{"$f":"(O32/Instructions!$C$27)*100","v":0},{"$f":"(U32/'Report Card'!$H$22)*100","v":{"$error":"#VALUE!"}},"----","E","E","E","E","E","--",null,null,null,null,null,{"$f":"Table_2[[#This Row],[Column51]]&Table_2[[#This Row],[Column52]]&AM34","v":""}]
[32,null,null,null,null,null,null,null,null,null,null,null,null,null,null,null,null,null,null,null,"--",0,null,null,{"$f":"(K33/Instructions!$C$23)*100","v":0},{"$f":"(L33/Instructions!$C$24)*100","v":0},{"$f":"(M33/Instructions!$C$25)*100","v":0},{"$f":"(N33/Instructions!$C$26)*100","v":0},{"$f":"(O33/Instructions!$C$27)*100","v":0},{"$f":"(U33/'Report Card'!$H$22)*100","v":{"$error":"#VALUE!"}},"----","E","E","E","E","E","--",null,null,null,null,null,{"$f":"Table_2[[#This Row],[Column51]]&Table_2[[#This Row],[Column52]]&AM35","v":""}]
[33,null,null,null,null,null,null,null,null,null,null,null,null,null,null,null,null,null,null,null,"--",0,null,null,{"$f":"(K34/Instructions!$C$23)*100","v":0},{"$f":"(L34/Instructions!$C$24)*100","v":0},{"$f":"(M34/Instructions!$C$25)*100","v":0},{"$f":"(N34/Instructions!$C$26)*100","v":0},{"$f":"(O34/Instructions!$C$27)*100","v":0},{"$f":"(U34/'Report Card'!$H$22)*100","v":{"$error":"#VALUE!"}},"----","E","E","E","E","E","--",null,null,null,null,null,{"$f":"Table_2[[#This Row],[Column51]]&Table_2[[#This Row],[Column52]]&AM36","v":""}]
[34,null,null,null,null,null,null,null,null,null,null,null,null,null,null,null,null,null,null,null,"--",0,null,null,{"$f":"(K35/Instructions!$C$23)*100","v":0},{"$f":"(L35/Instructions!$C$24)*100","v":0},{"$f":"(M35/Instructions!$C$25)*100","v":0},{"$f":"(N35/Instructions!$C$26)*100","v":0},{"$f":"(O35/Instructions!$C$27)*100","v":0},{"$f":"(U35/'Report Card'!$H$22)*100","v":{"$error":"#VALUE!"}},"----","E","E","E","E","E","--",null,null,null,null,null,{"$f":"Table_2[[#This Row],[Column51]]&Table_2[[#This Row],[Column52]]&AM37","v":""}]
[35,null,null,null,null,null,null,null,null,null,null,null,null,null,null,null,null,null,null,null,"--",0,null,null,{"$f":"(K36/Instructions!$C$23)*100","v":0},{"$f":"(L36/Instructions!$C$24)*100","v":0},{"$f":"(M36/Instructions!$C$25)*100","v":0},{"$f":"(N36/Instructions!$C$26)*100","v":0},{"$f":"(O36/Instructions!$C$27)*100","v":0},{"$f":"(U36/'Report Card'!$H$22)*100","v":{"$error":"#VALUE!"}},"----","E","E","E","E","E","--",null,null,null,null,null,{"$f":"Table_2[[#This Row],[Column51]]&Table_2[[#This Row],[Column52]]&AM38","v":""}]
[36,null,null,null,null,null,null,null,null,null,null,null,null,null,null,null,null,null,null,null,"--",0,null,null,{"$f":"(K37/Instructions!$C$23)*100","v":0},{"$f":"(L37/Instructions!$C$24)*100","v":0},{"$f":"(M37/Instructions!$C$25)*100","v":0},{"$f":"(N37/Instructions!$C$26)*100","v":0},{"$f":"(O37/Instructions!$C$27)*100","v":0},{"$f":"(U37/'Report Card'!$H$22)*100","v":{"$error":"#VALUE!"}},"----","E","E","E","E","E","--",null,null,null,null,null,{"$f":"Table_2[[#This Row],[Column51]]&Table_2[[#This Row],[Column52]]&AM39","v":""}]
[37,null,null,null,null,null,null,null,null,null,null,null,null,null,null,null,null,null,null,null,"--",0,null,null,{"$f":"(K38/Instructions!$C$23)*100","v":0},{"$f":"(L38/Instructions!$C$24)*100","v":0},{"$f":"(M38/Instructions!$C$25)*100","v":0},{"$f":"(N38/Instructions!$C$26)*100","v":0},{"$f":"(O38/Instructions!$C$27)*100","v":0},{"$f":"(U38/'Report Card'!$H$22)*100","v":{"$error":"#VALUE!"}},"----","E","E","E","E","E","--",null,null,null,null,null,{"$f":"Table_2[[#This Row],[Column51]]&Table_2[[#This Row],[Column52]]&AM40","v":""}]
[38,null,null,null,null,null,null,null,null,null,null,null,null,null,null,null,null,null,null,null,"--",0,null,null,{"$f":"(K39/Instructions!$C$23)*100","v":0},{"$f":"(L39/Instructions!$C$24)*100","v":0},{"$f":"(M39/Instructions!$C$25)*100","v":0},{"$f":"(N39/Instructions!$C$26)*100","v":0},{"$f":"(O39/Instructions!$C$27)*100","v":0},{"$f":"(U39/'Report Card'!$H$22)*100","v":{"$error":"#VALUE!"}},"----","E","E","E","E","E","--",null,null,null,null,null,{"$f":"Table_2[[#This Row],[Column51]]&Table_2[[#This Row],[Column52]]&AM41","v":""}]
[39,null,null,null,null,null,null,null,null,null,null,null,null,null,null,null,null,null,null,null,"--",0,null,null,{"$f":"(K40/Instructions!$C$23)*100","v":0},{"$f":"(L40/Instructions!$C$24)*100","v":0},{"$f":"(M40/Instructions!$C$25)*100","v":0},{"$f":"(N40/Instructions!$C$26)*100","v":0},{"$f":"(O40/Instructions!$C$27)*100","v":0},{"$f":"(U40/'Report Card'!$H$22)*100","v":{"$error":"#VALUE!"}},"----","E","E","E","E","E","--",null,null,null,null,null,{"$f":"Table_2[[#This Row],[Column51]]&Table_2[[#This Row],[Column52]]&AM42","v":""}]
[40,null,null,null,null,null,null,null,null,null,null,null,null,null,null,null,null,null,null,null,"--",0,null,null,{"$f":"(K41/Instructions!$C$23)*100","v":0},{"$f":"(L41/Instructions!$C$24)*100","v":0},{"$f":"(M41/Instructions!$C$25)*100","v":0},{"$f":"(N41/Instructions!$C$26)*100","v":0},{"$f":"(O41/Instructions!$C$27)*100","v":0},{"$f":"(U41/'Report Card'!$H$22)*100","v":{"$error":"#VALUE!"}},"----","E","E","E","E","E","--",null,null,null,null,null,{"$f":"Table_2[[#This Row],[Column51]]&Table_2[[#This Row],[Column52]]&AM43","v":""}]
[41,null,null,null,null,null,null,null,null,null,null,null,null,null,null,null,null,null,null,null,"--",0,null,null,{"$f":"(K42/Instructions!$C$23)*100","v":0},{"$f":"(L42/Instructions!$C$24)*100","v":0},{"$f":"(M42/Instructions!$C$25)*100","v":0},{"$f":"(N42/Instructions!$C$26)*100","v":0},{"$f":"(O42/Instructions!$C$27)*100","v":0},{"$f":"(U42/'Report Card'!$H$22)*100","v":{"$error":"#VALUE!"}},"----","E","E","E","E","E","--",null,null,null,null,null,{"$f":"Table_2[[#This Row],[Column51]]&Table_2[[#This Row],[Column52]]&AM44","v":""}]
[42,null,null,null,null,null,null,null,null,null,null,null,null,null,null,null,null,null,null,null,"--",0,null,null,{"$f":"(K43/Instructions!$C$23)*100","v":0},{"$f":"(L43/Instructions!$C$24)*100","v":0},{"$f":"(M43/Instructions!$C$25)*100","v":0},{"$f":"(N43/Instructions!$C$26)*100","v":0},{"$f":"(O43/Instructions!$C$27)*100","v":0},{"$f":"(U43/'Report Card'!$H$22)*100","v":{"$error":"#VALUE!"}},"----","E","E","E","E","E","--",null,null,null,null,null,{"$f":"Table_2[[#This Row],[Column51]]&Table_2[[#This Row],[Column52]]&AM45","v":""}]
[43,null,null,null,null,null,null,null,null,null,null,null,null,null,null,null,null,null,null,null,"--",0,null,null,{"$f":"(K44/Instructions!$C$23)*100","v":0},{"$f":"(L44/Instructions!$C$24)*100","v":0},{"$f":"(M44/Instructions!$C$25)*100","v":0},{"$f":"(N44/Instructions!$C$26)*100","v":0},{"$f":"(O44/Instructions!$C$27)*100","v":0},{"$f":"(U44/'Report Card'!$H$22)*100","v":{"$error":"#VALUE!"}},"----","E","E","E","E","E","--",null,null,null,null,null,{"$f":"Table_2[[#This Row],[Column51]]&Table_2[[#This Row],[Column52]]&AM46","v":""}]
[44,null,null,null,null,null,null,null,null,null,null,null,null,null,null,null,null,null,null,null,"--",0,null,null,{"$f":"(K45/Instructions!$C$23)*100","v":0},{"$f":"(L45/Instructions!$C$24)*100","v":0},{"$f":"(M45/Instructions!$C$25)*100","v":0},{"$f":"(N45/Instructions!$C$26)*100","v":0},{"$f":"(O45/Instructions!$C$27)*100","v":0},{"$f":"(U45/'Report Card'!$H$22)*100","v":{"$error":"#VALUE!"}},"----","E","E","E","E","E","--",null,null,null,null,null,{"$f":"Table_2[[#This Row],[Column51]]&Table_2[[#This Row],[Column52]]&AM47","v":""}]
[45,null,null,null,null,null,null,null,null,null,null,null,null,null,null,null,null,null,null,null,"--",0,null,null,{"$f":"(K46/Instructions!$C$23)*100","v":0},{"$f":"(L46/Instructions!$C$24)*100","v":0},{"$f":"(M46/Instructions!$C$25)*100","v":0},{"$f":"(N46/Instructions!$C$26)*100","v":0},{"$f":"(O46/Instructions!$C$27)*100","v":0},{"$f":"(U46/'Report Card'!$H$22)*100","v":{"$error":"#VALUE!"}},"----","E","E","E","E","E","--",null,null,null,null,null,{"$f":"Table_2[[#This Row],[Column51]]&Table_2[[#This Row],[Column52]]&AM48","v":""}]
[46,null,null,null,null,null,null,null,null,null,null,null,null,null,null,null,null,null,null,null,"--",0,null,null,{"$f":"(K47/Instructions!$C$23)*100","v":0},{"$f":"(L47/Instructions!$C$24)*100","v":0},{"$f":"(M47/Instructions!$C$25)*100","v":0},{"$f":"(N47/Instructions!$C$26)*100","v":0},{"$f":"(O47/Instructions!$C$27)*100","v":0},{"$f":"(U47/'Report Card'!$H$22)*100","v":{"$error":"#VALUE!"}},"----","E","E","E","E","E","--",null,null,null,null,null,{"$f":"Table_2[[#This Row],[Column51]]&Table_2[[#This Row],[Column52]]&AM49","v":""}]
[47,null,null,null,null,null,null,null,null,null,null,null,null,null,null,null,null,null,null,null,"--",0,null,null,{"$f":"(K48/Instructions!$C$23)*100","v":0},{"$f":"(L48/Instructions!$C$24)*100","v":0},{"$f":"(M48/Instructions!$C$25)*100","v":0},{"$f":"(N48/Instructions!$C$26)*100","v":0},{"$f":"(O48/Instructions!$C$27)*100","v":0},{"$f":"(U48/'Report Card'!$H$22)*100","v":{"$error":"#VALUE!"}},"----","E","E","E","E","E","--",null,null,null,null,null,{"$f":"Table_2[[#This Row],[Column51]]&Table_2[[#This Row],[Column52]]&AM50","v":""}]
[48,null,null,null,null,null,null,null,null,null,null,null,null,null,null,null,null,null,null,null,"--",0,null,null,{"$f":"(K49/Instructions!$C$23)*100","v":0},{"$f":"(L49/Instructions!$C$24)*100","v":0},{"$f":"(M49/Instructions!$C$25)*100","v":0},{"$f":"(N49/Instructions!$C$26)*100","v":0},{"$f":"(O49/Instructions!$C$27)*100","v":0},{"$f":"(U49/'Report Card'!$H$22)*100","v":{"$error":"#VALUE!"}},"----","E","E","E","E","E","--",null,null,null,null,null,{"$f":"Table_2[[#This Row],[Column51]]&Table_2[[#This Row],[Column52]]&AM51","v":""}]
[49,null,null,null,null,null,null,null,null,null,null,null,null,null,null,null,null,null,null,null,"--",0,null,null,{"$f":"(K50/Instructions!$C$23)*100","v":0},{"$f":"(L50/Instructions!$C$24)*100","v":0},{"$f":"(M50/Instructions!$C$25)*100","v":0},{"$f":"(N50/Instructions!$C$26)*100","v":0},{"$f":"(O50/Instructions!$C$27)*100","v":0},{"$f":"(U50/'Report Card'!$H$22)*100","v":{"$error":"#VALUE!"}},"----","E","E","E","E","E","--",null,null,null,null,null,{"$f":"Table_2[[#This Row],[Column51]]&Table_2[[#This Row],[Column52]]&AM52","v":""}]
[50,null,null,null,null,null,null,null,null,null,null,null,null,null,null,null,null,null,null,null,"--",0,null,null,{"$f":"(K51/Instructions!$C$23)*100","v":0},{"$f":"(L51/Instructions!$C$24)*100","v":0},{"$f":"(M51/Instructions!$C$25)*100","v":0},{"$f":"(N51/Instructions!$C$26)*100","v":0},{"$f":"(O51/Instructions!$C$27)*100","v":0},{"$f":"(U51/'Report Card'!$H$22)*100","v":{"$error":"#VALUE!"}},"----","E","E","E","E","E","--",null,null,null,null,null,{"$f":"Table_2[[#This Row],[Column51]]&Table_2[[#This Row],[Column52]]&AM53","v":""}]
[51,null,null,null,null,null,null,null,null,null,null,null,null,null,null,null,null,null,null,null,"--",0,null,null,{"$f":"(K52/Instructions!$C$23)*100","v":0},{"$f":"(L52/Instructions!$C$24)*100","v":0},{"$f":"(M52/Instructions!$C$25)*100","v":0},{"$f":"(N52/Instructions!$C$26)*100","v":0},{"$f":"(O52/Instructions!$C$27)*100","v":0},{"$f":"(U52/'Report Card'!$H$22)*100","v":{"$error":"#VALUE!"}},"----","E","E","E","E","E","--",null,null,null,null,null,{"$f":"Table_2[[#This Row],[Column51]]&Table_2[[#This Row],[Column52]]&AM54","v":""}]
[52,null,null,null,null,null,null,null,null,null,null,null,null,null,null,null,null,null,null,null,"--",0,null,null,{"$f":"(K53/Instructions!$C$23)*100","v":0},{"$f":"(L53/Instructions!$C$24)*100","v":0},{"$f":"(M53/Instructions!$C$25)*100","v":0},{"$f":"(N53/Instructions!$C$26)*100","v":0},{"$f":"(O53/Instructions!$C$27)*100","v":0},{"$f":"(U53/'Report Card'!$H$22)*100","v":{"$error":"#VALUE!"}},"----","E","E","E","E","E","--",null,null,null,null,null,{"$f":"Table_2[[#This Row],[Column51]]&Table_2[[#This Row],[Column52]]&AM55","v":""}]
[53,null,null,null,null,null,null,null,null,null,null,null,null,null,null,null,null,null,null,null,"--",0,null,null,{"$f":"(K54/Instructions!$C$23)*100","v":0},{"$f":"(L54/Instructions!$C$24)*100","v":0},{"$f":"(M54/Instructions!$C$25)*100","v":0},{"$f":"(N54/Instructions!$C$26)*100","v":0},{"$f":"(O54/Instructions!$C$27)*100","v":0},{"$f":"(U54/'Report Card'!$H$22)*100","v":{"$error":"#VALUE!"}},"----","E","E","E","E","E","--",null,null,null,null,null,{"$f":"Table_2[[#This Row],[Column51]]&Table_2[[#This Row],[Column52]]&AM56","v":""}]
[54,null,null,null,null,null,null,null,null,null,null,null,null,null,null,null,null,null,null,null,"--",0,null,null,{"$f":"(K55/Instructions!$C$23)*100","v":0},{"$f":"(L55/Instructions!$C$24)*100","v":0},{"$f":"(M55/Instructions!$C$25)*100","v":0},{"$f":"(N55/Instructions!$C$26)*100","v":0},{"$f":"(O55/Instructions!$C$27)*100","v":0},{"$f":"(U55/'Report Card'!$H$22)*100","v":{"$error":"#VALUE!"}},"----","E","E","E","E","E","--",null,null,null,null,null,{"$f":"Table_2[[#This Row],[Column51]]&Table_2[[#This Row],[Column52]]&AM57","v":""}]
[55,null,null,null,null,null,null,null,null,null,null,null,null,null,null,null,null,null,null,null,"--",0,null,null,{"$f":"(K56/Instructions!$C$23)*100","v":0},{"$f":"(L56/Instructions!$C$24)*100","v":0},{"$f":"(M56/Instructions!$C$25)*100","v":0},{"$f":"(N56/Instructions!$C$26)*100","v":0},{"$f":"(O56/Instructions!$C$27)*100","v":0},{"$f":"(U56/'Report Card'!$H$22)*100","v":{"$error":"#VALUE!"}},"----","E","E","E","E","E","--",null,null,null,null,null,{"$f":"Table_2[[#This Row],[Column51]]&Table_2[[#This Row],[Column52]]&AM58","v":""}]
[56,null,null,null,null,null,null,null,null,null,null,null,null,null,null,null,null,null,null,null,"--",0,null,null,{"$f":"(K57/Instructions!$C$23)*100","v":0},{"$f":"(L57/Instructions!$C$24)*100","v":0},{"$f":"(M57/Instructions!$C$25)*100","v":0},{"$f":"(N57/Instructions!$C$26)*100","v":0},{"$f":"(O57/Instructions!$C$27)*100","v":0},{"$f":"(U57/'Report Card'!$H$22)*100","v":{"$error":"#VALUE!"}},"----","E","E","E","E","E","--",null,null,null,null,null,{"$f":"Table_2[[#This Row],[Column51]]&Table_2[[#This Row],[Column52]]&AM59","v":""}]
[57,null,null,null,null,null,null,null,null,null,null,null,null,null,null,null,null,null,null,null,"--",0,null,null,{"$f":"(K58/Instructions!$C$23)*100","v":0},{"$f":"(L58/Instructions!$C$24)*100","v":0},{"$f":"(M58/Instructions!$C$25)*100","v":0},{"$f":"(N58/Instructions!$C$26)*100","v":0},{"$f":"(O58/Instructions!$C$27)*100","v":0},{"$f":"(U58/'Report Card'!$H$22)*100","v":{"$error":"#VALUE!"}},"----","E","E","E","E","E","--",null,null,null,null,null,{"$f":"Table_2[[#This Row],[Column51]]&Table_2[[#This Row],[Column52]]&AM60","v":""}]
[58,null,null,null,null,null,null,null,null,null,null,null,null,null,null,null,null,null,null,null,"--",0,null,null,{"$f":"(K59/Instructions!$C$23)*100","v":0},{"$f":"(L59/Instructions!$C$24)*100","v":0},{"$f":"(M59/Instructions!$C$25)*100","v":0},{"$f":"(N59/Instructions!$C$26)*100","v":0},{"$f":"(O59/Instructions!$C$27)*100","v":0},{"$f":"(U59/'Report Card'!$H$22)*100","v":{"$error":"#VALUE!"}},"----","E","E","E","E","E","--",null,null,null,null,null,{"$f":"Table_2[[#This Row],[Column51]]&Table_2[[#This Row],[Column52]]&AM61","v":""}]
[59,null,null,null,null,null,null,null,null,null,null,null,null,null,null,null,null,null,null,null,"--",0,null,null,{"$f":"(K60/Instructions!$C$23)*100","v":0},{"$f":"(L60/Instructions!$C$24)*100","v":0},{"$f":"(M60/Instructions!$C$25)*100","v":0},{"$f":"(N60/Instructions!$C$26)*100","v":0},{"$f":"(O60/Instructions!$C$27)*100","v":0},{"$f":"(U60/'Report Card'!$H$22)*100","v":{"$error":"#VALUE!"}},"----","E","E","E","E","E","--",null,null,null,null,null,{"$f":"Table_2[[#This Row],[Column51]]&Table_2[[#This Row],[Column52]]&AM62","v":""}]
[60,null,null,null,null,null,null,null,null,null,null,null,null,null,null,null,null,null,null,null,"--",0,null,null,{"$f":"(K61/Instructions!$C$23)*100","v":0},{"$f":"(L61/Instructions!$C$24)*100","v":0},{"$f":"(M61/Instructions!$C$25)*100","v":0},{"$f":"(N61/Instructions!$C$26)*100","v":0},{"$f":"(O61/Instructions!$C$27)*100","v":0},{"$f":"(U61/'Report Card'!$H$22)*100","v":{"$error":"#VALUE!"}},"----","E","E","E","E","E","--",null,null,null,null,null,{"$f":"Table_2[[#This Row],[Column51]]&Table_2[[#This Row],[Column52]]&AM63","v":""}]
[61,null,null,null,null,null,null,null,null,null,null,null,null,null,null,null,null,null,null,null,"--",0,null,null,{"$f":"(K62/Instructions!$C$23)*100","v":0},{"$f":"(L62/Instructions!$C$24)*100","v":0},{"$f":"(M62/Instructions!$C$25)*100","v":0},{"$f":"(N62/Instructions!$C$26)*100","v":0},{"$f":"(O62/Instructions!$C$27)*100","v":0},{"$f":"(U62/'Report Card'!$H$22)*100","v":{"$error":"#VALUE!"}},"----","E","E","E","E","E","--",null,null,null,null,null,{"$f":"Table_2[[#This Row],[Column51]]&Table_2[[#This Row],[Column52]]&AM64","v":""}]
[62,null,null,null,null,null,null,null,null,null,null,null,null,null,null,null,null,null,null,null,"--",0,null,null,{"$f":"(K63/Instructions!$C$23)*100","v":0},{"$f":"(L63/Instructions!$C$24)*100","v":0},{"$f":"(M63/Instructions!$C$25)*100","v":0},{"$f":"(N63/Instructions!$C$26)*100","v":0},{"$f":"(O63/Instructions!$C$27)*100","v":0},{"$f":"(U63/'Report Card'!$H$22)*100","v":{"$error":"#VALUE!"}},"----","E","E","E","E","E","--",null,null,null,null,null,{"$f":"Table_2[[#This Row],[Column51]]&Table_2[[#This Row],[Column52]]&AM65","v":""}]
[63,null,null,null,null,null,null,null,null,null,null,null,null,null,null,null,null,null,null,null,"--",0,null,null,{"$f":"(K64/Instructions!$C$23)*100","v":0},{"$f":"(L64/Instructions!$C$24)*100","v":0},{"$f":"(M64/Instructions!$C$25)*100","v":0},{"$f":"(N64/Instructions!$C$26)*100","v":0},{"$f":"(O64/Instructions!$C$27)*100","v":0},{"$f":"(U64/'Report Card'!$H$22)*100","v":{"$error":"#VALUE!"}},"----","E","E","E","E","E","--",null,null,null,null,null,{"$f":"Table_2[[#This Row],[Column51]]&Table_2[[#This Row],[Column52]]&AM66","v":""}]
[64,null,null,null,null,null,null,null,null,null,null,null,null,null,null,null,null,null,null,null,"--",0,null,null,{"$f":"(K65/Instructions!$C$23)*100","v":0},{"$f":"(L65/Instructions!$C$24)*100","v":0},{"$f":"(M65/Instructions!$C$25)*100","v":0},{"$f":"(N65/Instructions!$C$26)*100","v":0},{"$f":"(O65/Instructions!$C$27)*100","v":0},{"$f":"(U65/'Report Card'!$H$22)*100","v":{"$error":"#VALUE!"}},"----","E","E","E","E","E","--",null,null,null,null,null,{"$f":"Table_2[[#This Row],[Column51]]&Table_2[[#This Row],[Column52]]&AM67","v":""}]
[65,null,null,null,null,null,null,null,null,null,null,null,null,null,null,null,null,null,null,null,{"$f":"IF(MIN(Y66:AC66)>=33,SUM(K66:P66),\"--\")","v":"--"},0,null,null,{"$f":"(K66/Instructions!$C$23)*100","v":0},{"$f":"(L66/Instructions!$C$24)*100","v":0},{"$f":"(M66/Instructions!$C$25)*100","v":0},{"$f":"(N66/Instructions!$C$26)*100","v":0},{"$f":"(O66/Instructions!$C$27)*100","v":0},{"$f":"(U66/'Report Card'!$H$22)*100","v":{"$error":"#VALUE!"}},"----",{"$f":"IFERROR(IF(Y66>90,\"A+\",IF(Y66>80,\"A\",IF(Y66>70,\"B+\",IF(Y66>60,\"B\",IF(Y66>50,\"C+\",IF(Y66>40,\"C\",IF(Y66>=33,\"D\",\"E\"))))))),\"Abs\")","v":"E"},{"$f":"IFERROR(IF(Z66>90,\"A+\",IF(Z66>80,\"A\",IF(Z66>70,\"B+\",IF(Z66>60,\"B\",IF(Z66>50,\"C+\",IF(Z66>40,\"C\",IF(Z66>=33,\"D\",\"E\"))))))),\"Abs\")","v":"E"},{"$f":"IFERROR(IF(AA66>90,\"A+\",IF(AA66>80,\"A\",IF(AA66>70,\"B+\",IF(AA66>60,\"B\",IF(AA66>50,\"C+\",IF(AA66>40,\"C\",IF(AA66>=33,\"D\",\"E\"))))))),\"Abs\")","v":"E"},{"$f":"IFERROR(IF(AB66>90,\"A+\",IF(AB66>80,\"A\",IF(AB66>70,\"B+\",IF(AB66>60,\"B\",IF(AB66>50,\"C+\",IF(AB66>40,\"C\",IF(AB66>=33,\"D\",\"E\"))))))),\"Abs\")","v":"E"},{"$f":"IFERROR(IF(AC66>90,\"A+\",IF(AC66>80,\"A\",IF(AC66>70,\"B+\",IF(AC66>60,\"B\",IF(AC66>50,\"C+\",IF(AC66>40,\"C\",IF(AC66>=33,\"D\",\"E\"))))))),\"Abs\")","v":"E"},"--",null,null,null,null,null,{"$f":"Table_2[[#This Row],[Column51]]&Table_2[[#This Row],[Column52]]&AM68","v":""}]
[66,null,null,null,null,null,null,null,null,null,null,null,null,null,null,null,null,null,null,null,"--",{"$f":"IF(U67=\"--\",0,U67)","v":0},null,null,{"$f":"(K67/Instructions!$C$23)*100","v":0},{"$f":"(L67/Instructions!$C$24)*100","v":0},{"$f":"(M67/Instructions!$C$25)*100","v":0},{"$f":"(N67/Instructions!$C$26)*100","v":0},{"$f":"(O67/Instructions!$C$27)*100","v":0},{"$f":"(U67/'Report Card'!$H$22)*100","v":{"$error":"#VALUE!"}},{"$f":"IF(AND(Y67>=33,Z67>=33,AA67>=33,AB67>=33,AC67>=33),\"PASS\",\"----\")","v":"----"},"E","E","E","E","E",{"$f":"IFERROR(IF(AD67>90,\"A+\",IF(AD67>80,\"A\",IF(AD67>70,\"B+\",IF(AD67>60,\"B\",IF(AD67>50,\"C+\",IF(AD67>40,\"C\",IF(AD67>=33,\"D\",\"E\"))))))),\"--\")","v":"--"},null,null,null,null,null,{"$f":"Table_2[[#This Row],[Column51]]&Table_2[[#This Row],[Column52]]&AM69","v":""}]
[67,null,null,null,null,null,null,null,null,null,null,null,null,null,null,null,null,null,null,null,"--",0,null,null,{"$f":"(K68/Instructions!$C$23)*100","v":0},{"$f":"(L68/Instructions!$C$24)*100","v":0},{"$f":"(M68/Instructions!$C$25)*100","v":0},{"$f":"(N68/Instructions!$C$26)*100","v":0},{"$f":"(O68/Instructions!$C$27)*100","v":0},{"$f":"(U68/'Report Card'!$H$22)*100","v":{"$error":"#VALUE!"}},"----","E","E","E","E","E","--",null,null,null,null,null,{"$f":"Table_2[[#This Row],[Column51]]&Table_2[[#This Row],[Column52]]&AM70","v":""}]
[68,null,null,null,null,null,null,null,null,null,null,null,null,null,null,null,null,null,null,null,"--",0,null,null,{"$f":"(K69/Instructions!$C$23)*100","v":0},{"$f":"(L69/Instructions!$C$24)*100","v":0},{"$f":"(M69/Instructions!$C$25)*100","v":0},{"$f":"(N69/Instructions!$C$26)*100","v":0},{"$f":"(O69/Instructions!$C$27)*100","v":0},{"$f":"(U69/'Report Card'!$H$22)*100","v":{"$error":"#VALUE!"}},"----","E","E","E","E","E","--",null,null,null,null,null,{"$f":"Table_2[[#This Row],[Column51]]&Table_2[[#This Row],[Column52]]&AM71","v":""}]
[69,null,null,null,null,null,null,null,null,null,null,null,null,null,null,null,null,null,null,null,"--",0,null,null,{"$f":"(K70/Instructions!$C$23)*100","v":0},{"$f":"(L70/Instructions!$C$24)*100","v":0},{"$f":"(M70/Instructions!$C$25)*100","v":0},{"$f":"(N70/Instructions!$C$26)*100","v":0},{"$f":"(O70/Instructions!$C$27)*100","v":0},{"$f":"(U70/'Report Card'!$H$22)*100","v":{"$error":"#VALUE!"}},"----","E","E","E","E","E","--",null,null,null,null,null,{"$f":"Table_2[[#This Row],[Column51]]&Table_2[[#This Row],[Column52]]&AM72","v":""}]
[70,null,null,null,null,null,null,null,null,null,null,null,null,null,null,null,null,null,null,null,"--",0,null,null,{"$f":"(K71/Instructions!$C$23)*100","v":0},{"$f":"(L71/Instructions!$C$24)*100","v":0},{"$f":"(M71/Instructions!$C$25)*100","v":0},{"$f":"(N71/Instructions!$C$26)*100","v":0},{"$f":"(O71/Instructions!$C$27)*100","v":0},{"$f":"(U71/'Report Card'!$H$22)*100","v":{"$error":"#VALUE!"}},"----","E","E","E","E","E","--",null,null,null,null,null,{"$f":"Table_2[[#This Row],[Column51]]&Table_2[[#This Row],[Column52]]&AM73","v":""}]
[71,null,null,null,null,null,null,null,null,null,null,null,null,null,null,null,null,null,null,null,"--",0,null,null,{"$f":"(K72/Instructions!$C$23)*100","v":0},{"$f":"(L72/Instructions!$C$24)*100","v":0},{"$f":"(M72/Instructions!$C$25)*100","v":0},{"$f":"(N72/Instructions!$C$26)*100","v":0},{"$f":"(O72/Instructions!$C$27)*100","v":0},{"$f":"(U72/'Report Card'!$H$22)*100","v":{"$error":"#VALUE!"}},"----","E","E","E","E","E","--",null,null,null,null,null,{"$f":"Table_2[[#This Row],[Column51]]&Table_2[[#This Row],[Column52]]&AM74","v":""}]
[72,null,null,null,null,null,null,null,null,null,null,null,null,null,null,null,null,null,null,null,"--",0,null,null,{"$f":"(K73/Instructions!$C$23)*100","v":0},{"$f":"(L73/Instructions!$C$24)*100","v":0},{"$f":"(M73/Instructions!$C$25)*100","v":0},{"$f":"(N73/Instructions!$C$26)*100","v":0},{"$f":"(O73/Instructions!$C$27)*100","v":0},{"$f":"(U73/'Report Card'!$H$22)*100","v":{"$error":"#VALUE!"}},"----","E","E","E","E","E","--",null,null,null,null,null,{"$f":"Table_2[[#This Row],[Column51]]&Table_2[[#This Row],[Column52]]&AM75","v":""}]
[73,null,null,null,null,null,null,null,null,null,null,null,null,null,null,null,null,null,null,null,"--",0,null,null,{"$f":"(K74/Instructions!$C$23)*100","v":0},{"$f":"(L74/Instructions!$C$24)*100","v":0},{"$f":"(M74/Instructions!$C$25)*100","v":0},{"$f":"(N74/Instructions!$C$26)*100","v":0},{"$f":"(O74/Instructions!$C$27)*100","v":0},{"$f":"(U74/'Report Card'!$H$22)*100","v":{"$error":"#VALUE!"}},"----","E","E","E","E","E","--",null,null,null,null,null,{"$f":"Table_2[[#This Row],[Column51]]&Table_2[[#This Row],[Column52]]&AM76","v":""}]
[74,null,null,null,null,null,null,null,null,null,null,null,null,null,null,null,null,null,null,null,"--",0,null,null,{"$f":"(K75/Instructions!$C$23)*100","v":0},{"$f":"(L75/Instructions!$C$24)*100","v":0},{"$f":"(M75/Instructions!$C$25)*100","v":0},{"$f":"(N75/Instructions!$C$26)*100","v":0},{"$f":"(O75/Instructions!$C$27)*100","v":0},{"$f":"(U75/'Report Card'!$H$22)*100","v":{"$error":"#VALUE!"}},"----","E","E","E","E","E","--",null,null,null,null,null,{"$f":"Table_2[[#This Row],[Column51]]&Table_2[[#This Row],[Column52]]&AM77","v":""}]
[75,null,null,null,null,null,null,null,null,null,null,null,null,null,null,null,null,null,null,null,"--",0,null,null,{"$f":"(K76/Instructions!$C$23)*100","v":0},{"$f":"(L76/Instructions!$C$24)*100","v":0},{"$f":"(M76/Instructions!$C$25)*100","v":0},{"$f":"(N76/Instructions!$C$26)*100","v":0},{"$f":"(O76/Instructions!$C$27)*100","v":0},{"$f":"(U76/'Report Card'!$H$22)*100","v":{"$error":"#VALUE!"}},"----","E","E","E","E","E","--",null,null,null,null,null,{"$f":"Table_2[[#This Row],[Column51]]&Table_2[[#This Row],[Column52]]&AM78","v":""}]
[76,null,null,null,null,null,null,null,null,null,null,null,null,null,null,null,null,null,null,null,"--",0,null,null,{"$f":"(K77/Instructions!$C$23)*100","v":0},{"$f":"(L77/Instructions!$C$24)*100","v":0},{"$f":"(M77/Instructions!$C$25)*100","v":0},{"$f":"(N77/Instructions!$C$26)*100","v":0},{"$f":"(O77/Instructions!$C$27)*100","v":0},{"$f":"(U77/'Report Card'!$H$22)*100","v":{"$error":"#VALUE!"}},"----","E","E","E","E","E","--",null,null,null,null,null,{"$f":"Table_2[[#This Row],[Column51]]&Table_2[[#This Row],[Column52]]&AM79","v":""}]
[77,null,null,null,null,null,null,null,null,null,null,null,null,null,null,null,null,null,null,null,"--",0,null,null,{"$f":"(K78/Instructions!$C$23)*100","v":0},{"$f":"(L78/Instructions!$C$24)*100","v":0},{"$f":"(M78/Instructions!$C$25)*100","v":0},{"$f":"(N78/Instructions!$C$26)*100","v":0},{"$f":"(O78/Instructions!$C$27)*100","v":0},{"$f":"(U78/'Report Card'!$H$22)*100","v":{"$error":"#VALUE!"}},"----","E","E","E","E","E","--",null,null,null,null,null,{"$f":"Table_2[[#This Row],[Column51]]&Table_2[[#This Row],[Column52]]&AM80","v":""}]
[78,null,null,null,null,null,null,null,null,null,null,null,null,null,null,null,null,null,null,null,"--",0,null,null,{"$f":"(K79/Instructions!$C$23)*100","v":0},{"$f":"(L79/Instructions!$C$24)*100","v":0},{"$f":"(M79/Instructions!$C$25)*100","v":0},{"$f":"(N79/Instructions!$C$26)*100","v":0},{"$f":"(O79/Instructions!$C$27)*100","v":0},{"$f":"(U79/'Report Card'!$H$22)*100","v":{"$error":"#VALUE!"}},"----","E","E","E","E","E","--",null,null,null,null,null,{"$f":"Table_2[[#This Row],[Column51]]&Table_2[[#This Row],[Column52]]&AM81","v":""}]
[79,null,null,null,null,null,null,null,null,null,null,null,null,null,null,null,null,null,null,null,"--",0,null,null,{"$f":"(K80/Instructions!$C$23)*100","v":0},{"$f":"(L80/Instructions!$C$24)*100","v":0},{"$f":"(M80/Instructions!$C$25)*100","v":0},{"$f":"(N80/Instructions!$C$26)*100","v":0},{"$f":"(O80/Instructions!$C$27)*100","v":0},{"$f":"(U80/'Report Card'!$H$22)*100","v":{"$error":"#VALUE!"}},"----","E","E","E","E","E","--",null,null,null,null,null,{"$f":"Table_2[[#This Row],[Column51]]&Table_2[[#This Row],[Column52]]&AM82","v":""}]
[80,null,null,null,null,null,null,null,null,null,null,null,null,null,null,null,null,null,null,null,"--",0,null,null,{"$f":"(K81/Instructions!$C$23)*100","v":0},{"$f":"(L81/Instructions!$C$24)*100","v":0},{"$f":"(M81/Instructions!$C$25)*100","v":0},{"$f":"(N81/Instructions!$C$26)*100","v":0},{"$f":"(O81/Instructions!$C$27)*100","v":0},{"$f":"(U81/'Report Card'!$H$22)*100","v":{"$error":"#VALUE!"}},"----","E","E","E","E","E","--",null,null,null,null,null,{"$f":"Table_2[[#This Row],[Column51]]&Table_2[[#This Row],[Column52]]&AM83","v":""}]
[81,null,null,null,null,null,null,null,null,null,null,null,null,null,null,null,null,null,null,null,"--",0,null,null,{"$f":"(K82/Instructions!$C$23)*100","v":0},{"$f":"(L82/Instructions!$C$24)*100","v":0},{"$f":"(M82/Instructions!$C$25)*100","v":0},{"$f":"(N82/Instructions!$C$26)*100","v":0},{"$f":"(O82/Instructions!$C$27)*100","v":0},{"$f":"(U82/'Report Card'!$H$22)*100","v":{"$error":"#VALUE!"}},"----","E","E","E","E","E","--",null,null,null,null,null,{"$f":"Table_2[[#This Row],[Column51]]&Table_2[[#This Row],[Column52]]&AM84","v":""}]
[82,null,null,null,null,null,null,null,null,null,null,null,null,null,null,null,null,null,null,null,"--",0,null,null,{"$f":"(K83/Instructions!$C$23)*100","v":0},{"$f":"(L83/Instructions!$C$24)*100","v":0},{"$f":"(M83/Instructions!$C$25)*100","v":0},{"$f":"(N83/Instructions!$C$26)*100","v":0},{"$f":"(O83/Instructions!$C$27)*100","v":0},{"$f":"(U83/'Report Card'!$H$22)*100","v":{"$error":"#VALUE!"}},"----","E","E","E","E","E","--",null,null,null,null,null,{"$f":"Table_2[[#This Row],[Column51]]&Table_2[[#This Row],[Column52]]&AM85","v":""}]
[83,null,null,null,null,null,null,null,null,null,null,null,null,null,null,null,null,null,null,null,"--",0,null,null,{"$f":"(K84/Instructions!$C$23)*100","v":0},{"$f":"(L84/Instructions!$C$24)*100","v":0},{"$f":"(M84/Instructions!$C$25)*100","v":0},{"$f":"(N84/Instructions!$C$26)*100","v":0},{"$f":"(O84/Instructions!$C$27)*100","v":0},{"$f":"(U84/'Report Card'!$H$22)*100","v":{"$error":"#VALUE!"}},"----","E","E","E","E","E","--",null,null,null,null,null,{"$f":"Table_2[[#This Row],[Column51]]&Table_2[[#This Row],[Column52]]&AM86","v":""}]
[84,null,null,null,null,null,null,null,null,null,null,null,null,null,null,null,null,null,null,null,"--",0,null,null,{"$f":"(K85/Instructions!$C$23)*100","v":0},{"$f":"(L85/Instructions!$C$24)*100","v":0},{"$f":"(M85/Instructions!$C$25)*100","v":0},{"$f":"(N85/Instructions!$C$26)*100","v":0},{"$f":"(O85/Instructions!$C$27)*100","v":0},{"$f":"(U85/'Report Card'!$H$22)*100","v":{"$error":"#VALUE!"}},"----","E","E","E","E","E","--",null,null,null,null,null,{"$f":"Table_2[[#This Row],[Column51]]&Table_2[[#This Row],[Column52]]&AM87","v":""}]
[85,null,null,null,null,null,null,null,null,null,null,null,null,null,null,null,null,null,null,null,"--",0,null,null,{"$f":"(K86/Instructions!$C$23)*100","v":0},{"$f":"(L86/Instructions!$C$24)*100","v":0},{"$f":"(M86/Instructions!$C$25)*100","v":0},{"$f":"(N86/Instructions!$C$26)*100","v":0},{"$f":"(O86/Instructions!$C$27)*100","v":0},{"$f":"(U86/'Report Card'!$H$22)*100","v":{"$error":"#VALUE!"}},"----","E","E","E","E","E","--",null,null,null,null,null,{"$f":"Table_2[[#This Row],[Column51]]&Table_2[[#This Row],[Column52]]&AM88","v":""}]
[86,null,null,null,null,null,null,null,null,null,null,null,null,null,null,null,null,null,null,null,"--",0,null,null,{"$f":"(K87/Instructions!$C$23)*100","v":0},{"$f":"(L87/Instructions!$C$24)*100","v":0},{"$f":"(M87/Instructions!$C$25)*100","v":0},{"$f":"(N87/Instructions!$C$26)*100","v":0},{"$f":"(O87/Instructions!$C$27)*100","v":0},{"$f":"(U87/'Report Card'!$H$22)*100","v":{"$error":"#VALUE!"}},"----","E","E","E","E","E","--",null,null,null,null,null,{"$f":"Table_2[[#This Row],[Column51]]&Table_2[[#This Row],[Column52]]&AM89","v":""}]
[87,null,null,null,null,null,null,null,null,null,null,null,null,null,null,null,null,null,null,null,"--",0,null,null,{"$f":"(K88/Instructions!$C$23)*100","v":0},{"$f":"(L88/Instructions!$C$24)*100","v":0},{"$f":"(M88/Instructions!$C$25)*100","v":0},{"$f":"(N88/Instructions!$C$26)*100","v":0},{"$f":"(O88/Instructions!$C$27)*100","v":0},{"$f":"(U88/'Report Card'!$H$22)*100","v":{"$error":"#VALUE!"}},"----","E","E","E","E","E","--",null,null,null,null,null,{"$f":"Table_2[[#This Row],[Column51]]&Table_2[[#This Row],[Column52]]&AM90","v":""}]
[88,null,null,null,null,null,null,null,null,null,null,null,null,null,null,null,null,null,null,null,"--",0,null,null,{"$f":"(K89/Instructions!$C$23)*100","v":0},{"$f":"(L89/Instructions!$C$24)*100","v":0},{"$f":"(M89/Instructions!$C$25)*100","v":0},{"$f":"(N89/Instructions!$C$26)*100","v":0},{"$f":"(O89/Instructions!$C$27)*100","v":0},{"$f":"(U89/'Report Card'!$H$22)*100","v":{"$error":"#VALUE!"}},"----","E","E","E","E","E","--",null,null,null,null,null,{"$f":"Table_2[[#This Row],[Column51]]&Table_2[[#This Row],[Column52]]&AM91","v":""}]
[89,null,null,null,null,null,null,null,null,null,null,null,null,null,null,null,null,null,null,null,"--",0,null,null,{"$f":"(K90/Instructions!$C$23)*100","v":0},{"$f":"(L90/Instructions!$C$24)*100","v":0},{"$f":"(M90/Instructions!$C$25)*100","v":0},{"$f":"(N90/Instructions!$C$26)*100","v":0},{"$f":"(O90/Instructions!$C$27)*100","v":0},{"$f":"(U90/'Report Card'!$H$22)*100","v":{"$error":"#VALUE!"}},"----","E","E","E","E","E","--",null,null,null,null,null,{"$f":"Table_2[[#This Row],[Column51]]&Table_2[[#This Row],[Column52]]&AM92","v":""}]
[90,null,null,null,null,null,null,null,null,null,null,null,null,null,null,null,null,null,null,null,"--",0,null,null,{"$f":"(K91/Instructions!$C$23)*100","v":0},{"$f":"(L91/Instructions!$C$24)*100","v":0},{"$f":"(M91/Instructions!$C$25)*100","v":0},{"$f":"(N91/Instructions!$C$26)*100","v":0},{"$f":"(O91/Instructions!$C$27)*100","v":0},{"$f":"(U91/'Report Card'!$H$22)*100","v":{"$error":"#VALUE!"}},"----","E","E","E","E","E","--",null,null,null,null,null,{"$f":"Table_2[[#This Row],[Column51]]&Table_2[[#This Row],[Column52]]&AM93","v":""}]
[91,null,null,null,null,null,null,null,null,null,null,null,null,null,null,null,null,null,null,null,"--",0,null,null,{"$f":"(K92/Instructions!$C$23)*100","v":0},{"$f":"(L92/Instructions!$C$24)*100","v":0},{"$f":"(M92/Instructions!$C$25)*100","v":0},{"$f":"(N92/Instructions!$C$26)*100","v":0},{"$f":"(O92/Instructions!$C$27)*100","v":0},{"$f":"(U92/'Report Card'!$H$22)*100","v":{"$error":"#VALUE!"}},"----","E","E","E","E","E","--",null,null,null,null,null,{"$f":"Table_2[[#This Row],[Column51]]&Table_2[[#This Row],[Column52]]&AM94","v":""}]
[92,null,null,null,null,null,null,null,null,null,null,null,null,null,null,null,null,null,null,null,"--",0,null,null,{"$f":"(K93/Instructions!$C$23)*100","v":0},{"$f":"(L93/Instructions!$C$24)*100","v":0},{"$f":"(M93/Instructions!$C$25)*100","v":0},{"$f":"(N93/Instructions!$C$26)*100","v":0},{"$f":"(O93/Instructions!$C$27)*100","v":0},{"$f":"(U93/'Report Card'!$H$22)*100","v":{"$error":"#VALUE!"}},"----","E","E","E","E","E","--",null,null,null,null,null,{"$f":"Table_2[[#This Row],[Column51]]&Table_2[[#This Row],[Column52]]&AM95","v":""}]
[93,null,null,null,null,null,null,null,null,null,null,null,null,null,null,null,null,null,null,null,"--",0,null,null,{"$f":"(K94/Instructions!$C$23)*100","v":0},{"$f":"(L94/Instructions!$C$24)*100","v":0},{"$f":"(M94/Instructions!$C$25)*100","v":0},{"$f":"(N94/Instructions!$C$26)*100","v":0},{"$f":"(O94/Instructions!$C$27)*100","v":0},{"$f":"(U94/'Report Card'!$H$22)*100","v":{"$error":"#VALUE!"}},"----","E","E","E","E","E","--",null,null,null,null,null,{"$f":"Table_2[[#This Row],[Column51]]&Table_2[[#This Row],[Column52]]&AM96","v":""}]
[94,null,null,null,null,null,null,null,null,null,null,null,null,null,null,null,null,null,null,null,"--",0,null,null,{"$f":"(K95/Instructions!$C$23)*100","v":0},{"$f":"(L95/Instructions!$C$24)*100","v":0},{"$f":"(M95/Instructions!$C$25)*100","v":0},{"$f":"(N95/Instructions!$C$26)*100","v":0},{"$f":"(O95/Instructions!$C$27)*100","v":0},{"$f":"(U95/'Report Card'!$H$22)*100","v":{"$error":"#VALUE!"}},"----","E","E","E","E","E","--",null,null,null,null,null,{"$f":"Table_2[[#This Row],[Column51]]&Table_2[[#This Row],[Column52]]&AM97","v":""}]
[95,null,null,null,null,null,null,null,null,null,null,null,null,null,null,null,null,null,null,null,"--",0,null,null,{"$f":"(K96/Instructions!$C$23)*100","v":0},{"$f":"(L96/Instructions!$C$24)*100","v":0},{"$f":"(M96/Instructions!$C$25)*100","v":0},{"$f":"(N96/Instructions!$C$26)*100","v":0},{"$f":"(O96/Instructions!$C$27)*100","v":0},{"$f":"(U96/'Report Card'!$H$22)*100","v":{"$error":"#VALUE!"}},"----","E","E","E","E","E","--",null,null,null,null,null,{"$f":"Table_2[[#This Row],[Column51]]&Table_2[[#This Row],[Column52]]&AM98","v":""}]
[96,null,null,null,null,null,null,null,null,null,null,null,null,null,null,null,null,null,null,null,"--",0,null,null,{"$f":"(K97/Instructions!$C$23)*100","v":0},{"$f":"(L97/Instructions!$C$24)*100","v":0},{"$f":"(M97/Instructions!$C$25)*100","v":0},{"$f":"(N97/Instructions!$C$26)*100","v":0},{"$f":"(O97/Instructions!$C$27)*100","v":0},{"$f":"(U97/'Report Card'!$H$22)*100","v":{"$error":"#VALUE!"}},"----","E","E","E","E","E","--",null,null,null,null,null,{"$f":"Table_2[[#This Row],[Column51]]&Table_2[[#This Row],[Column52]]&AM99","v":""}]
[97,null,null,null,null,null,null,null,null,null,null,null,null,null,null,null,null,null,null,null,"--",0,null,null,{"$f":"(K98/Instructions!$C$23)*100","v":0},{"$f":"(L98/Instructions!$C$24)*100","v":0},{"$f":"(M98/Instructions!$C$25)*100","v":0},{"$f":"(N98/Instructions!$C$26)*100","v":0},{"$f":"(O98/Instructions!$C$27)*100","v":0},{"$f":"(U98/'Report Card'!$H$22)*100","v":{"$error":"#VALUE!"}},"----","E","E","E","E","E","--",null,null,null,null,null,{"$f":"Table_2[[#This Row],[Column51]]&Table_2[[#This Row],[Column52]]&AM100","v":""}]
[98,null,null,null,null,null,null,null,null,null,null,null,null,null,null,null,null,null,null,null,"--",0,null,null,{"$f":"(K99/Instructions!$C$23)*100","v":0},{"$f":"(L99/Instructions!$C$24)*100","v":0},{"$f":"(M99/Instructions!$C$25)*100","v":0},{"$f":"(N99/Instructions!$C$26)*100","v":0},{"$f":"(O99/Instructions!$C$27)*100","v":0},{"$f":"(U99/'Report Card'!$H$22)*100","v":{"$error":"#VALUE!"}},"----","E","E","E","E","E","--",null,null,null,null,null,{"$f":"Table_2[[#This Row],[Column51]]&Table_2[[#This Row],[Column52]]&AM101","v":""}]
[99,null,null,null,null,null,null,null,null,null,null,null,null,null,null,null,null,null,null,null,"--",0,null,null,{"$f":"(K100/Instructions!$C$23)*100","v":0},{"$f":"(L100/Instructions!$C$24)*100","v":0},{"$f":"(M100/Instructions!$C$25)*100","v":0},{"$f":"(N100/Instructions!$C$26)*100","v":0},{"$f":"(O100/Instructions!$C$27)*100","v":0},{"$f":"(U100/'Report Card'!$H$22)*100","v":{"$error":"#VALUE!"}},"----","E","E","E","E","E","--",null,null,null,null,null,{"$f":"Table_2[[#This Row],[Column51]]&Table_2[[#This Row],[Column52]]&AM102","v":""}]
[100,null,null,null,null,null,null,null,null,null,null,null,null,null,null,null,null,null,null,null,"--",0,null,null,{"$f":"(K101/Instructions!$C$23)*100","v":0},{"$f":"(L101/Instructions!$C$24)*100","v":0},{"$f":"(M101/Instructions!$C$25)*100","v":0},{"$f":"(N101/Instructions!$C$26)*100","v":0},{"$f":"(O101/Instructions!$C$27)*100","v":0},{"$f":"(U101/'Report Card'!$H$22)*100","v":{"$error":"#VALUE!"}},"----","E","E","E","E","E","--",null,null,null,null,null,{"$f":"Table_2[[#This Row],[Column51]]&Table_2[[#This Row],[Column52]]&AM103","v":""}]
[101,null,null,null,null,null,null,null,null,null,null,null,null,null,null,null,null,null,null,null,"--",0,null,null,{"$f":"(K102/Instructions!$C$23)*100","v":0},{"$f":"(L102/Instructions!$C$24)*100","v":0},{"$f":"(M102/Instructions!$C$25)*100","v":0},{"$f":"(N102/Instructions!$C$26)*100","v":0},{"$f":"(O102/Instructions!$C$27)*100","v":0},{"$f":"(U102/'Report Card'!$H$22)*100","v":{"$error":"#VALUE!"}},"----","E","E","E","E","E","--",null,null,null,null,null,{"$f":"Table_2[[#This Row],[Column51]]&Table_2[[#This Row],[Column52]]&AM104","v":""}]
[102,null,null,null,null,null,null,null,null,null,null,null,null,null,null,null,null,null,null,null,"--",0,null,null,{"$f":"(K103/Instructions!$C$23)*100","v":0},{"$f":"(L103/Instructions!$C$24)*100","v":0},{"$f":"(M103/Instructions!$C$25)*100","v":0},{"$f":"(N103/Instructions!$C$26)*100","v":0},{"$f":"(O103/Instructions!$C$27)*100","v":0},{"$f":"(U103/'Report Card'!$H$22)*100","v":{"$error":"#VALUE!"}},"----","E","E","E","E","E","--",null,null,null,null,null,{"$f":"Table_2[[#This Row],[Column51]]&Table_2[[#This Row],[Column52]]&AM105","v":""}]
[103,null,null,null,null,null,null,null,null,null,null,null,null,null,null,null,null,null,null,null,"--",0,null,null,{"$f":"(K104/Instructions!$C$23)*100","v":0},{"$f":"(L104/Instructions!$C$24)*100","v":0},{"$f":"(M104/Instructions!$C$25)*100","v":0},{"$f":"(N104/Instructions!$C$26)*100","v":0},{"$f":"(O104/Instructions!$C$27)*100","v":0},{"$f":"(U104/'Report Card'!$H$22)*100","v":{"$error":"#VALUE!"}},"----","E","E","E","E","E","--",null,null,null,null,null,{"$f":"Table_2[[#This Row],[Column51]]&Table_2[[#This Row],[Column52]]&AM106","v":""}]
[104,null,null,null,null,null,null,null,null,null,null,null,null,null,null,null,null,null,null,null,"--",0,null,null,{"$f":"(K105/Instructions!$C$23)*100","v":0},{"$f":"(L105/Instructions!$C$24)*100","v":0},{"$f":"(M105/Instructions!$C$25)*100","v":0},{"$f":"(N105/Instructions!$C$26)*100","v":0},{"$f":"(O105/Instructions!$C$27)*100","v":0},{"$f":"(U105/'Report Card'!$H$22)*100","v":{"$error":"#VALUE!"}},"----","E","E","E","E","E","--",null,null,null,null,null,{"$f":"Table_2[[#This Row],[Column51]]&Table_2[[#This Row],[Column52]]&AM107","v":""}]
[105,null,null,null,null,null,null,null,null,null,null,null,null,null,null,null,null,null,null,null,"--",0,null,null,{"$f":"(K106/Instructions!$C$23)*100","v":0},{"$f":"(L106/Instructions!$C$24)*100","v":0},{"$f":"(M106/Instructions!$C$25)*100","v":0},{"$f":"(N106/Instructions!$C$26)*100","v":0},{"$f":"(O106/Instructions!$C$27)*100","v":0},{"$f":"(U106/'Report Card'!$H$22)*100","v":{"$error":"#VALUE!"}},"----","E","E","E","E","E","--",null,null,null,null,null,{"$f":"Table_2[[#This Row],[Column51]]&Table_2[[#This Row],[Column52]]&AM108","v":""}]
[106,null,null,null,null,null,null,null,null,null,null,null,null,null,null,null,null,null,null,null,"--",0,null,null,{"$f":"(K107/Instructions!$C$23)*100","v":0},{"$f":"(L107/Instructions!$C$24)*100","v":0},{"$f":"(M107/Instructions!$C$25)*100","v":0},{"$f":"(N107/Instructions!$C$26)*100","v":0},{"$f":"(O107/Instructions!$C$27)*100","v":0},{"$f":"(U107/'Report Card'!$H$22)*100","v":{"$error":"#VALUE!"}},"----","E","E","E","E","E","--",null,null,null,null,null,{"$f":"Table_2[[#This Row],[Column51]]&Table_2[[#This Row],[Column52]]&AM109","v":""}]
[107,null,null,null,null,null,null,null,null,null,null,null,null,null,null,null,null,null,null,null,"--",0,null,null,{"$f":"(K108/Instructions!$C$23)*100","v":0},{"$f":"(L108/Instructions!$C$24)*100","v":0},{"$f":"(M108/Instructions!$C$25)*100","v":0},{"$f":"(N108/Instructions!$C$26)*100","v":0},{"$f":"(O108/Instructions!$C$27)*100","v":0},{"$f":"(U108/'Report Card'!$H$22)*100","v":{"$error":"#VALUE!"}},"----","E","E","E","E","E","--",null,null,null,null,null,{"$f":"Table_2[[#This Row],[Column51]]&Table_2[[#This Row],[Column52]]&AM110","v":""}]
[108,null,null,null,null,null,null,null,null,null,null,null,null,null,null,null,null,null,null,null,"--",0,null,null,{"$f":"(K109/Instructions!$C$23)*100","v":0},{"$f":"(L109/Instructions!$C$24)*100","v":0},{"$f":"(M109/Instructions!$C$25)*100","v":0},{"$f":"(N109/Instructions!$C$26)*100","v":0},{"$f":"(O109/Instructions!$C$27)*100","v":0},{"$f":"(U109/'Report Card'!$H$22)*100","v":{"$error":"#VALUE!"}},"----","E","E","E","E","E","--",null,null,null,null,null,{"$f":"Table_2[[#This Row],[Column51]]&Table_2[[#This Row],[Column52]]&AM111","v":""}]
[109,null,null,null,null,null,null,null,null,null,null,null,null,null,null,null,null,null,null,null,"--",0,null,null,{"$f":"(K110/Instructions!$C$23)*100","v":0},{"$f":"(L110/Instructions!$C$24)*100","v":0},{"$f":"(M110/Instructions!$C$25)*100","v":0},{"$f":"(N110/Instructions!$C$26)*100","v":0},{"$f":"(O110/Instructions!$C$27)*100","v":0},{"$f":"(U110/'Report Card'!$H$22)*100","v":{"$error":"#VALUE!"}},"----","E","E","E","E","E","--",null,null,null,null,null,{"$f":"Table_2[[#This Row],[Column51]]&Table_2[[#This Row],[Column52]]&AM112","v":""}]
[110,null,null,null,null,null,null,null,null,null,null,null,null,null,null,null,null,null,null,null,"--",0,null,null,{"$f":"(K111/Instructions!$C$23)*100","v":0},{"$f":"(L111/Instructions!$C$24)*100","v":0},{"$f":"(M111/Instructions!$C$25)*100","v":0},{"$f":"(N111/Instructions!$C$26)*100","v":0},{"$f":"(O111/Instructions!$C$27)*100","v":0},{"$f":"(U111/'Report Card'!$H$22)*100","v":{"$error":"#VALUE!"}},"----","E","E","E","E","E","--",null,null,null,null,null,{"$f":"Table_2[[#This Row],[Column51]]&Table_2[[#This Row],[Column52]]&AM113","v":""}]
[111,null,null,null,null,null,null,null,null,null,null,null,null,null,null,null,null,null,null,null,"--",0,null,null,{"$f":"(K112/Instructions!$C$23)*100","v":0},{"$f":"(L112/Instructions!$C$24)*100","v":0},{"$f":"(M112/Instructions!$C$25)*100","v":0},{"$f":"(N112/Instructions!$C$26)*100","v":0},{"$f":"(O112/Instructions!$C$27)*100","v":0},{"$f":"(U112/'Report Card'!$H$22)*100","v":{"$error":"#VALUE!"}},"----","E","E","E","E","E","--",null,null,null,null,null,{"$f":"Table_2[[#This Row],[Column51]]&Table_2[[#This Row],[Column52]]&AM114","v":""}]
[112,null,null,null,null,null,null,null,null,null,null,null,null,null,null,null,null,null,null,null,"--",0,null,null,{"$f":"(K113/Instructions!$C$23)*100","v":0},{"$f":"(L113/Instructions!$C$24)*100","v":0},{"$f":"(M113/Instructions!$C$25)*100","v":0},{"$f":"(N113/Instructions!$C$26)*100","v":0},{"$f":"(O113/Instructions!$C$27)*100","v":0},{"$f":"(U113/'Report Card'!$H$22)*100","v":{"$error":"#VALUE!"}},"----","E","E","E","E","E","--",null,null,null,null,null,{"$f":"Table_2[[#This Row],[Column51]]&Table_2[[#This Row],[Column52]]&AM115","v":""}]
[113,null,null,null,null,null,null,null,null,null,null,null,null,null,null,null,null,null,null,null,"--",0,null,null,{"$f":"(K114/Instructions!$C$23)*100","v":0},{"$f":"(L114/Instructions!$C$24)*100","v":0},{"$f":"(M114/Instructions!$C$25)*100","v":0},{"$f":"(N114/Instructions!$C$26)*100","v":0},{"$f":"(O114/Instructions!$C$27)*100","v":0},{"$f":"(U114/'Report Card'!$H$22)*100","v":{"$error":"#VALUE!"}},"----","E","E","E","E","E","--",null,null,null,null,null,{"$f":"Table_2[[#This Row],[Column51]]&Table_2[[#This Row],[Column52]]&AM116","v":""}]
[114,null,null,null,null,null,null,null,null,null,null,null,null,null,null,null,null,null,null,null,"--",0,null,null,{"$f":"(K115/Instructions!$C$23)*100","v":0},{"$f":"(L115/Instructions!$C$24)*100","v":0},{"$f":"(M115/Instructions!$C$25)*100","v":0},{"$f":"(N115/Instructions!$C$26)*100","v":0},{"$f":"(O115/Instructions!$C$27)*100","v":0},{"$f":"(U115/'Report Card'!$H$22)*100","v":{"$error":"#VALUE!"}},"----","E","E","E","E","E","--",null,null,null,null,null,{"$f":"Table_2[[#This Row],[Column51]]&Table_2[[#This Row],[Column52]]&AM117","v":""}]
[115,null,null,null,null,null,null,null,null,null,null,null,null,null,null,null,null,null,null,null,"--",0,null,null,{"$f":"(K116/Instructions!$C$23)*100","v":0},{"$f":"(L116/Instructions!$C$24)*100","v":0},{"$f":"(M116/Instructions!$C$25)*100","v":0},{"$f":"(N116/Instructions!$C$26)*100","v":0},{"$f":"(O116/Instructions!$C$27)*100","v":0},{"$f":"(U116/'Report Card'!$H$22)*100","v":{"$error":"#VALUE!"}},"----","E","E","E","E","E","--",null,null,null,null,null,{"$f":"Table_2[[#This Row],[Column51]]&Table_2[[#This Row],[Column52]]&AM118","v":""}]
[116,null,null,null,null,null,null,null,null,null,null,null,null,null,null,null,null,null,null,null,"--",0,null,null,{"$f":"(K117/Instructions!$C$23)*100","v":0},{"$f":"(L117/Instructions!$C$24)*100","v":0},{"$f":"(M117/Instructions!$C$25)*100","v":0},{"$f":"(N117/Instructions!$C$26)*100","v":0},{"$f":"(O117/Instructions!$C$27)*100","v":0},{"$f":"(U117/'Report Card'!$H$22)*100","v":{"$error":"#VALUE!"}},"----","E","E","E","E","E","--",null,null,null,null,null,{"$f":"Table_2[[#This Row],[Column51]]&Table_2[[#This Row],[Column52]]&AM119","v":""}]
[117,null,null,null,null,null,null,null,null,null,null,null,null,null,null,null,null,null,null,null,"--",0,null,null,{"$f":"(K118/Instructions!$C$23)*100","v":0},{"$f":"(L118/Instructions!$C$24)*100","v":0},{"$f":"(M118/Instructions!$C$25)*100","v":0},{"$f":"(N118/Instructions!$C$26)*100","v":0},{"$f":"(O118/Instructions!$C$27)*100","v":0},{"$f":"(U118/'Report Card'!$H$22)*100","v":{"$error":"#VALUE!"}},"----","E","E","E","E","E","--",null,null,null,null,null,{"$f":"Table_2[[#This Row],[Column51]]&Table_2[[#This Row],[Column52]]&AM120","v":""}]
[118,null,null,null,null,null,null,null,null,null,null,null,null,null,null,null,null,null,null,null,"--",0,null,null,{"$f":"(K119/Instructions!$C$23)*100","v":0},{"$f":"(L119/Instructions!$C$24)*100","v":0},{"$f":"(M119/Instructions!$C$25)*100","v":0},{"$f":"(N119/Instructions!$C$26)*100","v":0},{"$f":"(O119/Instructions!$C$27)*100","v":0},{"$f":"(U119/'Report Card'!$H$22)*100","v":{"$error":"#VALUE!"}},"----","E","E","E","E","E","--",null,null,null,null,null,{"$f":"Table_2[[#This Row],[Column51]]&Table_2[[#This Row],[Column52]]&AM121","v":""}]
[119,null,null,null,null,null,null,null,null,null,null,null,null,null,null,null,null,null,null,null,"--",0,null,null,{"$f":"(K120/Instructions!$C$23)*100","v":0},{"$f":"(L120/Instructions!$C$24)*100","v":0},{"$f":"(M120/Instructions!$C$25)*100","v":0},{"$f":"(N120/Instructions!$C$26)*100","v":0},{"$f":"(O120/Instructions!$C$27)*100","v":0},{"$f":"(U120/'Report Card'!$H$22)*100","v":{"$error":"#VALUE!"}},"----","E","E","E","E","E","--",null,null,null,null,null,{"$f":"Table_2[[#This Row],[Column51]]&Table_2[[#This Row],[Column52]]&AM122","v":""}]
[120,null,null,null,null,null,null,null,null,null,null,null,null,null,null,null,null,null,null,null,"--",0,null,null,{"$f":"(K121/Instructions!$C$23)*100","v":0},{"$f":"(L121/Instructions!$C$24)*100","v":0},{"$f":"(M121/Instructions!$C$25)*100","v":0},{"$f":"(N121/Instructions!$C$26)*100","v":0},{"$f":"(O121/Instructions!$C$27)*100","v":0},{"$f":"(U121/'Report Card'!$H$22)*100","v":{"$error":"#VALUE!"}},"----","E","E","E","E","E","--",null,null,null,null,null,{"$f":"Table_2[[#This Row],[Column51]]&Table_2[[#This Row],[Column52]]&AM123","v":""}]
[121,null,null,null,null,null,null,null,null,null,null,null,null,null,null,null,null,null,null,null,"--",0,null,null,{"$f":"(K122/Instructions!$C$23)*100","v":0},{"$f":"(L122/Instructions!$C$24)*100","v":0},{"$f":"(M122/Instructions!$C$25)*100","v":0},{"$f":"(N122/Instructions!$C$26)*100","v":0},{"$f":"(O122/Instructions!$C$27)*100","v":0},{"$f":"(U122/'Report Card'!$H$22)*100","v":{"$error":"#VALUE!"}},"----","E","E","E","E","E","--",null,null,null,null,null,{"$f":"Table_2[[#This Row],[Column51]]&Table_2[[#This Row],[Column52]]&AM124","v":""}]
[122,null,null,null,null,null,null,null,null,null,null,null,null,null,null,null,null,null,null,null,"--",0,null,null,{"$f":"(K123/Instructions!$C$23)*100","v":0},{"$f":"(L123/Instructions!$C$24)*100","v":0},{"$f":"(M123/Instructions!$C$25)*100","v":0},{"$f":"(N123/Instructions!$C$26)*100","v":0},{"$f":"(O123/Instructions!$C$27)*100","v":0},{"$f":"(U123/'Report Card'!$H$22)*100","v":{"$error":"#VALUE!"}},"----","E","E","E","E","E","--",null,null,null,null,null,{"$f":"Table_2[[#This Row],[Column51]]&Table_2[[#This Row],[Column52]]&AM125","v":""}]
[123,null,null,null,null,null,null,null,null,null,null,null,null,null,null,null,null,null,null,null,"--",0,null,null,{"$f":"(K124/Instructions!$C$23)*100","v":0},{"$f":"(L124/Instructions!$C$24)*100","v":0},{"$f":"(M124/Instructions!$C$25)*100","v":0},{"$f":"(N124/Instructions!$C$26)*100","v":0},{"$f":"(O124/Instructions!$C$27)*100","v":0},{"$f":"(U124/'Report Card'!$H$22)*100","v":{"$error":"#VALUE!"}},"----","E","E","E","E","E","--",null,null,null,null,null,{"$f":"Table_2[[#This Row],[Column51]]&Table_2[[#This Row],[Column52]]&AM126","v":""}]
[124,null,null,null,null,null,null,null,null,null,null,null,null,null,null,null,null,null,null,null,"--",0,null,null,{"$f":"(K125/Instructions!$C$23)*100","v":0},{"$f":"(L125/Instructions!$C$24)*100","v":0},{"$f":"(M125/Instructions!$C$25)*100","v":0},{"$f":"(N125/Instructions!$C$26)*100","v":0},{"$f":"(O125/Instructions!$C$27)*100","v":0},{"$f":"(U125/'Report Card'!$H$22)*100","v":{"$error":"#VALUE!"}},"----","E","E","E","E","E","--",null,null,null,null,null,{"$f":"Table_2[[#This Row],[Column51]]&Table_2[[#This Row],[Column52]]&AM127","v":""}]
[125,null,null,null,null,null,null,null,null,null,null,null,null,null,null,null,null,null,null,null,"--",0,null,null,{"$f":"(K126/Instructions!$C$23)*100","v":0},{"$f":"(L126/Instructions!$C$24)*100","v":0},{"$f":"(M126/Instructions!$C$25)*100","v":0},{"$f":"(N126/Instructions!$C$26)*100","v":0},{"$f":"(O126/Instructions!$C$27)*100","v":0},{"$f":"(U126/'Report Card'!$H$22)*100","v":{"$error":"#VALUE!"}},"----","E","E","E","E","E","--",null,null,null,null,null,{"$f":"Table_2[[#This Row],[Column51]]&Table_2[[#This Row],[Column52]]&AM128","v":""}]
[126,null,null,null,null,null,null,null,null,null,null,null,null,null,null,null,null,null,null,null,"--",0,null,null,{"$f":"(K127/Instructions!$C$23)*100","v":0},{"$f":"(L127/Instructions!$C$24)*100","v":0},{"$f":"(M127/Instructions!$C$25)*100","v":0},{"$f":"(N127/Instructions!$C$26)*100","v":0},{"$f":"(O127/Instructions!$C$27)*100","v":0},{"$f":"(U127/'Report Card'!$H$22)*100","v":{"$error":"#VALUE!"}},"----","E","E","E","E","E","--",null,null,null,null,null,{"$f":"Table_2[[#This Row],[Column51]]&Table_2[[#This Row],[Column52]]&AM129","v":""}]
[127,null,null,null,null,null,null,null,null,null,null,null,null,null,null,null,null,null,null,null,"--",0,null,null,{"$f":"(K128/Instructions!$C$23)*100","v":0},{"$f":"(L128/Instructions!$C$24)*100","v":0},{"$f":"(M128/Instructions!$C$25)*100","v":0},{"$f":"(N128/Instructions!$C$26)*100","v":0},{"$f":"(O128/Instructions!$C$27)*100","v":0},{"$f":"(U128/'Report Card'!$H$22)*100","v":{"$error":"#VALUE!"}},"----","E","E","E","E","E","--",null,null,null,null,null,{"$f":"Table_2[[#This Row],[Column51]]&Table_2[[#This Row],[Column52]]&AM130","v":""}]
[128,null,null,null,null,null,null,null,null,null,null,null,null,null,null,null,null,null,null,null,"--",0,null,null,{"$f":"(K129/Instructions!$C$23)*100","v":0},{"$f":"(L129/Instructions!$C$24)*100","v":0},{"$f":"(M129/Instructions!$C$25)*100","v":0},{"$f":"(N129/Instructions!$C$26)*100","v":0},{"$f":"(O129/Instructions!$C$27)*100","v":0},{"$f":"(U129/'Report Card'!$H$22)*100","v":{"$error":"#VALUE!"}},"----","E","E","E","E","E","--",null,null,null,null,null,{"$f":"Table_2[[#This Row],[Column51]]&Table_2[[#This Row],[Column52]]&AM131","v":""}]
[129,null,null,null,null,null,null,null,null,null,null,null,null,null,null,null,null,null,null,null,{"$f":"IF(MIN(Y130:AC130)>=33,SUM(K130:P130),\"--\")","v":"--"},0,null,null,{"$f":"(K130/Instructions!$C$23)*100","v":0},{"$f":"(L130/Instructions!$C$24)*100","v":0},{"$f":"(M130/Instructions!$C$25)*100","v":0},{"$f":"(N130/Instructions!$C$26)*100","v":0},{"$f":"(O130/Instructions!$C$27)*100","v":0},{"$f":"(U130/'Report Card'!$H$22)*100","v":{"$error":"#VALUE!"}},"----",{"$f":"IFERROR(IF(Y130>90,\"A+\",IF(Y130>80,\"A\",IF(Y130>70,\"B+\",IF(Y130>60,\"B\",IF(Y130>50,\"C+\",IF(Y130>40,\"C\",IF(Y130>=33,\"D\",\"E\"))))))),\"Abs\")","v":"E"},{"$f":"IFERROR(IF(Z130>90,\"A+\",IF(Z130>80,\"A\",IF(Z130>70,\"B+\",IF(Z130>60,\"B\",IF(Z130>50,\"C+\",IF(Z130>40,\"C\",IF(Z130>=33,\"D\",\"E\"))))))),\"Abs\")","v":"E"},{"$f":"IFERROR(IF(AA130>90,\"A+\",IF(AA130>80,\"A\",IF(AA130>70,\"B+\",IF(AA130>60,\"B\",IF(AA130>50,\"C+\",IF(AA130>40,\"C\",IF(AA130>=33,\"D\",\"E\"))))))),\"Abs\")","v":"E"},{"$f":"IFERROR(IF(AB130>90,\"A+\",IF(AB130>80,\"A\",IF(AB130>70,\"B+\",IF(AB130>60,\"B\",IF(AB130>50,\"C+\",IF(AB130>40,\"C\",IF(AB130>=33,\"D\",\"E\"))))))),\"Abs\")","v":"E"},{"$f":"IFERROR(IF(AC130>90,\"A+\",IF(AC130>80,\"A\",IF(AC130>70,\"B+\",IF(AC130>60,\"B\",IF(AC130>50,\"C+\",IF(AC130>40,\"C\",IF(AC130>=33,\"D\",\"E\"))))))),\"Abs\")","v":"E"},"--",null,null,null,null,null,{"$f":"Table_2[[#This Row],[Column51]]&Table_2[[#This Row],[Column52]]&AM132","v":""}]
[130,null,null,null,null,null,null,null,null,null,null,null,null,null,null,null,null,null,null,null,"--",{"$f":"IF(U131=\"--\",0,U131)","v":0},null,null,{"$f":"(K131/Instructions!$C$23)*100","v":0},{"$f":"(L131/Instructions!$C$24)*100","v":0},{"$f":"(M131/Instructions!$C$25)*100","v":0},{"$f":"(N131/Instructions!$C$26)*100","v":0},{"$f":"(O131/Instructions!$C$27)*100","v":0},{"$f":"(U131/'Report Card'!$H$22)*100","v":{"$error":"#VALUE!"}},{"$f":"IF(AND(Y131>=33,Z131>=33,AA131>=33,AB131>=33,AC131>=33),\"PASS\",\"----\")","v":"----"},"E","E","E","E","E",{"$f":"IFERROR(IF(AD131>90,\"A+\",IF(AD131>80,\"A\",IF(AD131>70,\"B+\",IF(AD131>60,\"B\",IF(AD131>50,\"C+\",IF(AD131>40,\"C\",IF(AD131>=33,\"D\",\"E\"))))))),\"--\")","v":"--"},null,null,null,null,null,{"$f":"Table_2[[#This Row],[Column51]]&Table_2[[#This Row],[Column52]]&AM133","v":""}]
[131,null,null,null,null,null,null,null,null,null,null,null,null,null,null,null,null,null,null,null,"--",0,null,null,{"$f":"(K132/Instructions!$C$23)*100","v":0},{"$f":"(L132/Instructions!$C$24)*100","v":0},{"$f":"(M132/Instructions!$C$25)*100","v":0},{"$f":"(N132/Instructions!$C$26)*100","v":0},{"$f":"(O132/Instructions!$C$27)*100","v":0},{"$f":"(U132/'Report Card'!$H$22)*100","v":{"$error":"#VALUE!"}},"----","E","E","E","E","E","--",null,null,null,null,null,{"$f":"Table_2[[#This Row],[Column51]]&Table_2[[#This Row],[Column52]]&AM134","v":""}]
[132,null,null,null,null,null,null,null,null,null,null,null,null,null,null,null,null,null,null,null,"--",0,null,null,{"$f":"(K133/Instructions!$C$23)*100","v":0},{"$f":"(L133/Instructions!$C$24)*100","v":0},{"$f":"(M133/Instructions!$C$25)*100","v":0},{"$f":"(N133/Instructions!$C$26)*100","v":0},{"$f":"(O133/Instructions!$C$27)*100","v":0},{"$f":"(U133/'Report Card'!$H$22)*100","v":{"$error":"#VALUE!"}},"----","E","E","E","E","E","--",null,null,null,null,null,{"$f":"Table_2[[#This Row],[Column51]]&Table_2[[#This Row],[Column52]]&AM135","v":""}]
[133,null,null,null,null,null,null,null,null,null,null,null,null,null,null,null,null,null,null,null,"--",0,null,null,{"$f":"(K134/Instructions!$C$23)*100","v":0},{"$f":"(L134/Instructions!$C$24)*100","v":0},{"$f":"(M134/Instructions!$C$25)*100","v":0},{"$f":"(N134/Instructions!$C$26)*100","v":0},{"$f":"(O134/Instructions!$C$27)*100","v":0},{"$f":"(U134/'Report Card'!$H$22)*100","v":{"$error":"#VALUE!"}},"----","E","E","E","E","E","--",null,null,null,null,null,{"$f":"Table_2[[#This Row],[Column51]]&Table_2[[#This Row],[Column52]]&AM136","v":""}]
[134,null,null,null,null,null,null,null,null,null,null,null,null,null,null,null,null,null,null,null,"--",0,null,null,{"$f":"(K135/Instructions!$C$23)*100","v":0},{"$f":"(L135/Instructions!$C$24)*100","v":0},{"$f":"(M135/Instructions!$C$25)*100","v":0},{"$f":"(N135/Instructions!$C$26)*100","v":0},{"$f":"(O135/Instructions!$C$27)*100","v":0},{"$f":"(U135/'Report Card'!$H$22)*100","v":{"$error":"#VALUE!"}},"----","E","E","E","E","E","--",null,null,null,null,null,{"$f":"Table_2[[#This Row],[Column51]]&Table_2[[#This Row],[Column52]]&AM137","v":""}]
[135,null,null,null,null,null,null,null,null,null,null,null,null,null,null,null,null,null,null,null,"--",0,null,null,{"$f":"(K136/Instructions!$C$23)*100","v":0},{"$f":"(L136/Instructions!$C$24)*100","v":0},{"$f":"(M136/Instructions!$C$25)*100","v":0},{"$f":"(N136/Instructions!$C$26)*100","v":0},{"$f":"(O136/Instructions!$C$27)*100","v":0},{"$f":"(U136/'Report Card'!$H$22)*100","v":{"$error":"#VALUE!"}},"----","E","E","E","E","E","--",null,null,null,null,null,{"$f":"Table_2[[#This Row],[Column51]]&Table_2[[#This Row],[Column52]]&AM138","v":""}]
[136,null,null,null,null,null,null,null,null,null,null,null,null,null,null,null,null,null,null,null,"--",0,null,null,{"$f":"(K137/Instructions!$C$23)*100","v":0},{"$f":"(L137/Instructions!$C$24)*100","v":0},{"$f":"(M137/Instructions!$C$25)*100","v":0},{"$f":"(N137/Instructions!$C$26)*100","v":0},{"$f":"(O137/Instructions!$C$27)*100","v":0},{"$f":"(U137/'Report Card'!$H$22)*100","v":{"$error":"#VALUE!"}},"----","E","E","E","E","E","--",null,null,null,null,null,{"$f":"Table_2[[#This Row],[Column51]]&Table_2[[#This Row],[Column52]]&AM139","v":""}]
[137,null,null,null,null,null,null,null,null,null,null,null,null,null,null,null,null,null,null,null,"--",0,null,null,{"$f":"(K138/Instructions!$C$23)*100","v":0},{"$f":"(L138/Instructions!$C$24)*100","v":0},{"$f":"(M138/Instructions!$C$25)*100","v":0},{"$f":"(N138/Instructions!$C$26)*100","v":0},{"$f":"(O138/Instructions!$C$27)*100","v":0},{"$f":"(U138/'Report Card'!$H$22)*100","v":{"$error":"#VALUE!"}},"----","E","E","E","E","E","--",null,null,null,null,null,{"$f":"Table_2[[#This Row],[Column51]]&Table_2[[#This Row],[Column52]]&AM140","v":""}]
[138,null,null,null,null,null,null,null,null,null,null,null,null,null,null,null,null,null,null,null,"--",0,null,null,{"$f":"(K139/Instructions!$C$23)*100","v":0},{"$f":"(L139/Instructions!$C$24)*100","v":0},{"$f":"(M139/Instructions!$C$25)*100","v":0},{"$f":"(N139/Instructions!$C$26)*100","v":0},{"$f":"(O139/Instructions!$C$27)*100","v":0},{"$f":"(U139/'Report Card'!$H$22)*100","v":{"$error":"#VALUE!"}},"----","E","E","E","E","E","--",null,null,null,null,null,{"$f":"Table_2[[#This Row],[Column51]]&Table_2[[#This Row],[Column52]]&AM141","v":""}]
[139,null,null,null,null,null,null,null,null,null,null,null,null,null,null,null,null,null,null,null,"--",0,null,null,{"$f":"(K140/Instructions!$C$23)*100","v":0},{"$f":"(L140/Instructions!$C$24)*100","v":0},{"$f":"(M140/Instructions!$C$25)*100","v":0},{"$f":"(N140/Instructions!$C$26)*100","v":0},{"$f":"(O140/Instructions!$C$27)*100","v":0},{"$f":"(U140/'Report Card'!$H$22)*100","v":{"$error":"#VALUE!"}},"----","E","E","E","E","E","--",null,null,null,null,null,{"$f":"Table_2[[#This Row],[Column51]]&Table_2[[#This Row],[Column52]]&AM142","v":""}]
[140,null,null,null,null,null,null,null,null,null,null,null,null,null,null,null,null,null,null,null,"--",0,null,null,{"$f":"(K141/Instructions!$C$23)*100","v":0},{"$f":"(L141/Instructions!$C$24)*100","v":0},{"$f":"(M141/Instructions!$C$25)*100","v":0},{"$f":"(N141/Instructions!$C$26)*100","v":0},{"$f":"(O141/Instructions!$C$27)*100","v":0},{"$f":"(U141/'Report Card'!$H$22)*100","v":{"$error":"#VALUE!"}},"----","E","E","E","E","E","--",null,null,null,null,null,{"$f":"Table_2[[#This Row],[Column51]]&Table_2[[#This Row],[Column52]]&AM143","v":""}]
[141,null,null,null,null,null,null,null,null,null,null,null,null,null,null,null,null,null,null,null,"--",0,null,null,{"$f":"(K142/Instructions!$C$23)*100","v":0},{"$f":"(L142/Instructions!$C$24)*100","v":0},{"$f":"(M142/Instructions!$C$25)*100","v":0},{"$f":"(N142/Instructions!$C$26)*100","v":0},{"$f":"(O142/Instructions!$C$27)*100","v":0},{"$f":"(U142/'Report Card'!$H$22)*100","v":{"$error":"#VALUE!"}},"----","E","E","E","E","E","--",null,null,null,null,null,{"$f":"Table_2[[#This Row],[Column51]]&Table_2[[#This Row],[Column52]]&AM144","v":""}]
[142,null,null,null,null,null,null,null,null,null,null,null,null,null,null,null,null,null,null,null,"--",0,null,null,{"$f":"(K143/Instructions!$C$23)*100","v":0},{"$f":"(L143/Instructions!$C$24)*100","v":0},{"$f":"(M143/Instructions!$C$25)*100","v":0},{"$f":"(N143/Instructions!$C$26)*100","v":0},{"$f":"(O143/Instructions!$C$27)*100","v":0},{"$f":"(U143/'Report Card'!$H$22)*100","v":{"$error":"#VALUE!"}},"----","E","E","E","E","E","--",null,null,null,null,null,{"$f":"Table_2[[#This Row],[Column51]]&Table_2[[#This Row],[Column52]]&AM145","v":""}]
[143,null,null,null,null,null,null,null,null,null,null,null,null,null,null,null,null,null,null,null,"--",0,null,null,{"$f":"(K144/Instructions!$C$23)*100","v":0},{"$f":"(L144/Instructions!$C$24)*100","v":0},{"$f":"(M144/Instructions!$C$25)*100","v":0},{"$f":"(N144/Instructions!$C$26)*100","v":0},{"$f":"(O144/Instructions!$C$27)*100","v":0},{"$f":"(U144/'Report Card'!$H$22)*100","v":{"$error":"#VALUE!"}},"----","E","E","E","E","E","--",null,null,null,null,null,{"$f":"Table_2[[#This Row],[Column51]]&Table_2[[#This Row],[Column52]]&AM146","v":""}]
[144,null,null,null,null,null,null,null,null,null,null,null,null,null,null,null,null,null,null,null,"--",0,null,null,{"$f":"(K145/Instructions!$C$23)*100","v":0},{"$f":"(L145/Instructions!$C$24)*100","v":0},{"$f":"(M145/Instructions!$C$25)*100","v":0},{"$f":"(N145/Instructions!$C$26)*100","v":0},{"$f":"(O145/Instructions!$C$27)*100","v":0},{"$f":"(U145/'Report Card'!$H$22)*100","v":{"$error":"#VALUE!"}},"----","E","E","E","E","E","--",null,null,null,null,null,{"$f":"Table_2[[#This Row],[Column51]]&Table_2[[#This Row],[Column52]]&AM147","v":""}]
[145,null,null,null,null,null,null,null,null,null,null,null,null,null,null,null,null,null,null,null,"--",0,null,null,{"$f":"(K146/Instructions!$C$23)*100","v":0},{"$f":"(L146/Instructions!$C$24)*100","v":0},{"$f":"(M146/Instructions!$C$25)*100","v":0},{"$f":"(N146/Instructions!$C$26)*100","v":0},{"$f":"(O146/Instructions!$C$27)*100","v":0},{"$f":"(U146/'Report Card'!$H$22)*100","v":{"$error":"#VALUE!"}},"----","E","E","E","E","E","--",null,null,null,null,null,{"$f":"Table_2[[#This Row],[Column51]]&Table_2[[#This Row],[Column52]]&AM148","v":""}]
[146,null,null,null,null,null,null,null,null,null,null,null,null,null,null,null,null,null,null,null,"--",0,null,null,{"$f":"(K147/Instructions!$C$23)*100","v":0},{"$f":"(L147/Instructions!$C$24)*100","v":0},{"$f":"(M147/Instructions!$C$25)*100","v":0},{"$f":"(N147/Instructions!$C$26)*100","v":0},{"$f":"(O147/Instructions!$C$27)*100","v":0},{"$f":"(U147/'Report Card'!$H$22)*100","v":{"$error":"#VALUE!"}},"----","E","E","E","E","E","--",null,null,null,null,null,{"$f":"Table_2[[#This Row],[Column51]]&Table_2[[#This Row],[Column52]]&AM149","v":""}]
[147,null,null,null,null,null,null,null,null,null,null,null,null,null,null,null,null,null,null,null,"--",0,null,null,{"$f":"(K148/Instructions!$C$23)*100","v":0},{"$f":"(L148/Instructions!$C$24)*100","v":0},{"$f":"(M148/Instructions!$C$25)*100","v":0},{"$f":"(N148/Instructions!$C$26)*100","v":0},{"$f":"(O148/Instructions!$C$27)*100","v":0},{"$f":"(U148/'Report Card'!$H$22)*100","v":{"$error":"#VALUE!"}},"----","E","E","E","E","E","--",null,null,null,null,null,{"$f":"Table_2[[#This Row],[Column51]]&Table_2[[#This Row],[Column52]]&AM150","v":""}]
[148,null,null,null,null,null,null,null,null,null,null,null,null,null,null,null,null,null,null,null,"--",0,null,null,{"$f":"(K149/Instructions!$C$23)*100","v":0},{"$f":"(L149/Instructions!$C$24)*100","v":0},{"$f":"(M149/Instructions!$C$25)*100","v":0},{"$f":"(N149/Instructions!$C$26)*100","v":0},{"$f":"(O149/Instructions!$C$27)*100","v":0},{"$f":"(U149/'Report Card'!$H$22)*100","v":{"$error":"#VALUE!"}},"----","E","E","E","E","E","--",null,null,null,null,null,{"$f":"Table_2[[#This Row],[Column51]]&Table_2[[#This Row],[Column52]]&AM151","v":""}]
[149,null,null,null,null,null,null,null,null,null,null,null,null,null,null,null,null,null,null,null,"--",0,null,null,{"$f":"(K150/Instructions!$C$23)*100","v":0},{"$f":"(L150/Instructions!$C$24)*100","v":0},{"$f":"(M150/Instructions!$C$25)*100","v":0},{"$f":"(N150/Instructions!$C$26)*100","v":0},{"$f":"(O150/Instructions!$C$27)*100","v":0},{"$f":"(U150/'Report Card'!$H$22)*100","v":{"$error":"#VALUE!"}},"----","E","E","E","E","E","--",null,null,null,null,null,{"$f":"Table_2[[#This Row],[Column51]]&Table_2[[#This Row],[Column52]]&AM152","v":""}]
[150,null,null,null,null,null,null,null,null,null,null,null,null,null,null,null,null,null,null,null,"--",0,null,null,{"$f":"(K151/Instructions!$C$23)*100","v":0},{"$f":"(L151/Instructions!$C$24)*100","v":0},{"$f":"(M151/Instructions!$C$25)*100","v":0},{"$f":"(N151/Instructions!$C$26)*100","v":0},{"$f":"(O151/Instructions!$C$27)*100","v":0},{"$f":"(U151/'Report Card'!$H$22)*100","v":{"$error":"#VALUE!"}},"----","E","E","E","E","E","--",null,null,null,null,null,{"$f":"Table_2[[#This Row],[Column51]]&Table_2[[#This Row],[Column52]]&AM153","v":""}]
[151,null,null,null,null,null,null,null,null,null,null,null,null,null,null,null,null,null,null,null,"--",0,null,null,{"$f":"(K152/Instructions!$C$23)*100","v":0},{"$f":"(L152/Instructions!$C$24)*100","v":0},{"$f":"(M152/Instructions!$C$25)*100","v":0},{"$f":"(N152/Instructions!$C$26)*100","v":0},{"$f":"(O152/Instructions!$C$27)*100","v":0},{"$f":"(U152/'Report Card'!$H$22)*100","v":{"$error":"#VALUE!"}},"----","E","E","E","E","E","--",null,null,null,null,null,{"$f":"Table_2[[#This Row],[Column51]]&Table_2[[#This Row],[Column52]]&AM154","v":""}]
[152,null,null,null,null,null,null,null,null,null,null,null,null,null,null,null,null,null,null,null,"--",0,null,null,{"$f":"(K153/Instructions!$C$23)*100","v":0},{"$f":"(L153/Instructions!$C$24)*100","v":0},{"$f":"(M153/Instructions!$C$25)*100","v":0},{"$f":"(N153/Instructions!$C$26)*100","v":0},{"$f":"(O153/Instructions!$C$27)*100","v":0},{"$f":"(U153/'Report Card'!$H$22)*100","v":{"$error":"#VALUE!"}},"----","E","E","E","E","E","--",null,null,null,null,null,{"$f":"Table_2[[#This Row],[Column51]]&Table_2[[#This Row],[Column52]]&AM155","v":""}]
[153,null,null,null,null,null,null,null,null,null,null,null,null,null,null,null,null,null,null,null,"--",0,null,null,{"$f":"(K154/Instructions!$C$23)*100","v":0},{"$f":"(L154/Instructions!$C$24)*100","v":0},{"$f":"(M154/Instructions!$C$25)*100","v":0},{"$f":"(N154/Instructions!$C$26)*100","v":0},{"$f":"(O154/Instructions!$C$27)*100","v":0},{"$f":"(U154/'Report Card'!$H$22)*100","v":{"$error":"#VALUE!"}},"----","E","E","E","E","E","--",null,null,null,null,null,{"$f":"Table_2[[#This Row],[Column51]]&Table_2[[#This Row],[Column52]]&AM156","v":""}]
[154,null,null,null,null,null,null,null,null,null,null,null,null,null,null,null,null,null,null,null,"--",0,null,null,{"$f":"(K155/Instructions!$C$23)*100","v":0},{"$f":"(L155/Instructions!$C$24)*100","v":0},{"$f":"(M155/Instructions!$C$25)*100","v":0},{"$f":"(N155/Instructions!$C$26)*100","v":0},{"$f":"(O155/Instructions!$C$27)*100","v":0},{"$f":"(U155/'Report Card'!$H$22)*100","v":{"$error":"#VALUE!"}},"----","E","E","E","E","E","--",null,null,null,null,null,{"$f":"Table_2[[#This Row],[Column51]]&Table_2[[#This Row],[Column52]]&AM157","v":""}]
[155,null,null,null,null,null,null,null,null,null,null,null,null,null,null,null,null,null,null,null,"--",0,null,null,{"$f":"(K156/Instructions!$C$23)*100","v":0},{"$f":"(L156/Instructions!$C$24)*100","v":0},{"$f":"(M156/Instructions!$C$25)*100","v":0},{"$f":"(N156/Instructions!$C$26)*100","v":0},{"$f":"(O156/Instructions!$C$27)*100","v":0},{"$f":"(U156/'Report Card'!$H$22)*100","v":{"$error":"#VALUE!"}},"----","E","E","E","E","E","--",null,null,null,null,null,{"$f":"Table_2[[#This Row],[Column51]]&Table_2[[#This Row],[Column52]]&AM158","v":""}]
[156,null,null,null,null,null,null,null,null,null,null,null,null,null,null,null,null,null,null,null,"--",0,null,null,{"$f":"(K157/Instructions!$C$23)*100","v":0},{"$f":"(L157/Instructions!$C$24)*100","v":0},{"$f":"(M157/Instructions!$C$25)*100","v":0},{"$f":"(N157/Instructions!$C$26)*100","v":0},{"$f":"(O157/Instructions!$C$27)*100","v":0},{"$f":"(U157/'Report Card'!$H$22)*100","v":{"$error":"#VALUE!"}},"----","E","E","E","E","E","--",null,null,null,null,null,{"$f":"Table_2[[#This Row],[Column51]]&Table_2[[#This Row],[Column52]]&AM159","v":""}]
[157,null,null,null,null,null,null,null,null,null,null,null,null,null,null,null,null,null,null,null,"--",0,null,null,{"$f":"(K158/Instructions!$C$23)*100","v":0},{"$f":"(L158/Instructions!$C$24)*100","v":0},{"$f":"(M158/Instructions!$C$25)*100","v":0},{"$f":"(N158/Instructions!$C$26)*100","v":0},{"$f":"(O158/Instructions!$C$27)*100","v":0},{"$f":"(U158/'Report Card'!$H$22)*100","v":{"$error":"#VALUE!"}},"----","E","E","E","E","E","--",null,null,null,null,null,{"$f":"Table_2[[#This Row],[Column51]]&Table_2[[#This Row],[Column52]]&AM160","v":""}]
[158,null,null,null,null,null,null,null,null,null,null,null,null,null,null,null,null,null,null,null,"--",0,null,null,{"$f":"(K159/Instructions!$C$23)*100","v":0},{"$f":"(L159/Instructions!$C$24)*100","v":0},{"$f":"(M159/Instructions!$C$25)*100","v":0},{"$f":"(N159/Instructions!$C$26)*100","v":0},{"$f":"(O159/Instructions!$C$27)*100","v":0},{"$f":"(U159/'Report Card'!$H$22)*100","v":{"$error":"#VALUE!"}},"----","E","E","E","E","E","--",null,null,null,null,null,{"$f":"Table_2[[#This Row],[Column51]]&Table_2[[#This Row],[Column52]]&AM161","v":""}]
[159,null,null,null,null,null,null,null,null,null,null,null,null,null,null,null,null,null,null,null,"--",0,null,null,{"$f":"(K160/Instructions!$C$23)*100","v":0},{"$f":"(L160/Instructions!$C$24)*100","v":0},{"$f":"(M160/Instructions!$C$25)*100","v":0},{"$f":"(N160/Instructions!$C$26)*100","v":0},{"$f":"(O160/Instructions!$C$27)*100","v":0},{"$f":"(U160/'Report Card'!$H$22)*100","v":{"$error":"#VALUE!"}},"----","E","E","E","E","E","--",null,null,null,null,null,{"$f":"Table_2[[#This Row],[Column51]]&Table_2[[#This Row],[Column52]]&AM162","v":""}]
[160,null,null,null,null,null,null,null,null,null,null,null,null,null,null,null,null,null,null,null,"--",0,null,null,{"$f":"(K161/Instructions!$C$23)*100","v":0},{"$f":"(L161/Instructions!$C$24)*100","v":0},{"$f":"(M161/Instructions!$C$25)*100","v":0},{"$f":"(N161/Instructions!$C$26)*100","v":0},{"$f":"(O161/Instructions!$C$27)*100","v":0},{"$f":"(U161/'Report Card'!$H$22)*100","v":{"$error":"#VALUE!"}},"----","E","E","E","E","E","--",null,null,null,null,null,{"$f":"Table_2[[#This Row],[Column51]]&Table_2[[#This Row],[Column52]]&AM163","v":""}]
[161,null,null,null,null,null,null,null,null,null,null,null,null,null,null,null,null,null,null,null,"--",0,null,null,{"$f":"(K162/Instructions!$C$23)*100","v":0},{"$f":"(L162/Instructions!$C$24)*100","v":0},{"$f":"(M162/Instructions!$C$25)*100","v":0},{"$f":"(N162/Instructions!$C$26)*100","v":0},{"$f":"(O162/Instructions!$C$27)*100","v":0},{"$f":"(U162/'Report Card'!$H$22)*100","v":{"$error":"#VALUE!"}},"----","E","E","E","E","E","--",null,null,null,null,null,{"$f":"Table_2[[#This Row],[Column51]]&Table_2[[#This Row],[Column52]]&AM164","v":""}]
[162,null,null,null,null,null,null,null,null,null,null,null,null,null,null,null,null,null,null,null,"--",0,null,null,{"$f":"(K163/Instructions!$C$23)*100","v":0},{"$f":"(L163/Instructions!$C$24)*100","v":0},{"$f":"(M163/Instructions!$C$25)*100","v":0},{"$f":"(N163/Instructions!$C$26)*100","v":0},{"$f":"(O163/Instructions!$C$27)*100","v":0},{"$f":"(U163/'Report Card'!$H$22)*100","v":{"$error":"#VALUE!"}},"----","E","E","E","E","E","--",null,null,null,null,null,{"$f":"Table_2[[#This Row],[Column51]]&Table_2[[#This Row],[Column52]]&AM165","v":""}]
[163,null,null,null,null,null,null,null,null,null,null,null,null,null,null,null,null,null,null,null,"--",0,null,null,{"$f":"(K164/Instructions!$C$23)*100","v":0},{"$f":"(L164/Instructions!$C$24)*100","v":0},{"$f":"(M164/Instructions!$C$25)*100","v":0},{"$f":"(N164/Instructions!$C$26)*100","v":0},{"$f":"(O164/Instructions!$C$27)*100","v":0},{"$f":"(U164/'Report Card'!$H$22)*100","v":{"$error":"#VALUE!"}},"----","E","E","E","E","E","--",null,null,null,null,null,{"$f":"Table_2[[#This Row],[Column51]]&Table_2[[#This Row],[Column52]]&AM166","v":""}]
[164,null,null,null,null,null,null,null,null,null,null,null,null,null,null,null,null,null,null,null,"--",0,null,null,{"$f":"(K165/Instructions!$C$23)*100","v":0},{"$f":"(L165/Instructions!$C$24)*100","v":0},{"$f":"(M165/Instructions!$C$25)*100","v":0},{"$f":"(N165/Instructions!$C$26)*100","v":0},{"$f":"(O165/Instructions!$C$27)*100","v":0},{"$f":"(U165/'Report Card'!$H$22)*100","v":{"$error":"#VALUE!"}},"----","E","E","E","E","E","--",null,null,null,null,null,{"$f":"Table_2[[#This Row],[Column51]]&Table_2[[#This Row],[Column52]]&AM167","v":""}]
[165,null,null,null,null,null,null,null,null,null,null,null,null,null,null,null,null,null,null,null,"--",0,null,null,{"$f":"(K166/Instructions!$C$23)*100","v":0},{"$f":"(L166/Instructions!$C$24)*100","v":0},{"$f":"(M166/Instructions!$C$25)*100","v":0},{"$f":"(N166/Instructions!$C$26)*100","v":0},{"$f":"(O166/Instructions!$C$27)*100","v":0},{"$f":"(U166/'Report Card'!$H$22)*100","v":{"$error":"#VALUE!"}},"----","E","E","E","E","E","--",null,null,null,null,null,{"$f":"Table_2[[#This Row],[Column51]]&Table_2[[#This Row],[Column52]]&AM168","v":""}]
[166,null,null,null,null,null,null,null,null,null,null,null,null,null,null,null,null,null,null,null,"--",0,null,null,{"$f":"(K167/Instructions!$C$23)*100","v":0},{"$f":"(L167/Instructions!$C$24)*100","v":0},{"$f":"(M167/Instructions!$C$25)*100","v":0},{"$f":"(N167/Instructions!$C$26)*100","v":0},{"$f":"(O167/Instructions!$C$27)*100","v":0},{"$f":"(U167/'Report Card'!$H$22)*100","v":{"$error":"#VALUE!"}},"----","E","E","E","E","E","--",null,null,null,null,null,{"$f":"Table_2[[#This Row],[Column51]]&Table_2[[#This Row],[Column52]]&AM169","v":""}]
[167,null,null,null,null,null,null,null,null,null,null,null,null,null,null,null,null,null,null,null,"--",0,null,null,{"$f":"(K168/Instructions!$C$23)*100","v":0},{"$f":"(L168/Instructions!$C$24)*100","v":0},{"$f":"(M168/Instructions!$C$25)*100","v":0},{"$f":"(N168/Instructions!$C$26)*100","v":0},{"$f":"(O168/Instructions!$C$27)*100","v":0},{"$f":"(U168/'Report Card'!$H$22)*100","v":{"$error":"#VALUE!"}},"----","E","E","E","E","E","--",null,null,null,null,null,{"$f":"Table_2[[#This Row],[Column51]]&Table_2[[#This Row],[Column52]]&AM170","v":""}]
[168,null,null,null,null,null,null,null,null,null,null,null,null,null,null,null,null,null,null,null,"--",0,null,null,{"$f":"(K169/Instructions!$C$23)*100","v":0},{"$f":"(L169/Instructions!$C$24)*100","v":0},{"$f":"(M169/Instructions!$C$25)*100","v":0},{"$f":"(N169/Instructions!$C$26)*100","v":0},{"$f":"(O169/Instructions!$C$27)*100","v":0},{"$f":"(U169/'Report Card'!$H$22)*100","v":{"$error":"#VALUE!"}},"----","E","E","E","E","E","--",null,null,null,null,null,{"$f":"Table_2[[#This Row],[Column51]]&Table_2[[#This Row],[Column52]]&AM171","v":""}]
[169,null,null,null,null,null,null,null,null,null,null,null,null,null,null,null,null,null,null,null,"--",0,null,null,{"$f":"(K170/Instructions!$C$23)*100","v":0},{"$f":"(L170/Instructions!$C$24)*100","v":0},{"$f":"(M170/Instructions!$C$25)*100","v":0},{"$f":"(N170/Instructions!$C$26)*100","v":0},{"$f":"(O170/Instructions!$C$27)*100","v":0},{"$f":"(U170/'Report Card'!$H$22)*100","v":{"$error":"#VALUE!"}},"----","E","E","E","E","E","--",null,null,null,null,null,{"$f":"Table_2[[#This Row],[Column51]]&Table_2[[#This Row],[Column52]]&AM172","v":""}]
[170,null,null,null,null,null,null,null,null,null,null,null,null,null,null,null,null,null,null,null,"--",0,null,null,{"$f":"(K171/Instructions!$C$23)*100","v":0},{"$f":"(L171/Instructions!$C$24)*100","v":0},{"$f":"(M171/Instructions!$C$25)*100","v":0},{"$f":"(N171/Instructions!$C$26)*100","v":0},{"$f":"(O171/Instructions!$C$27)*100","v":0},{"$f":"(U171/'Report Card'!$H$22)*100","v":{"$error":"#VALUE!"}},"----","E","E","E","E","E","--",null,null,null,null,null,{"$f":"Table_2[[#This Row],[Column51]]&Table_2[[#This Row],[Column52]]&AM173","v":""}]
[171,null,null,null,null,null,null,null,null,null,null,null,null,null,null,null,null,null,null,null,"--",0,null,null,{"$f":"(K172/Instructions!$C$23)*100","v":0},{"$f":"(L172/Instructions!$C$24)*100","v":0},{"$f":"(M172/Instructions!$C$25)*100","v":0},{"$f":"(N172/Instructions!$C$26)*100","v":0},{"$f":"(O172/Instructions!$C$27)*100","v":0},{"$f":"(U172/'Report Card'!$H$22)*100","v":{"$error":"#VALUE!"}},"----","E","E","E","E","E","--",null,null,null,null,null,{"$f":"Table_2[[#This Row],[Column51]]&Table_2[[#This Row],[Column52]]&AM174","v":""}]
[172,null,null,null,null,null,null,null,null,null,null,null,null,null,null,null,null,null,null,null,"--",0,null,null,{"$f":"(K173/Instructions!$C$23)*100","v":0},{"$f":"(L173/Instructions!$C$24)*100","v":0},{"$f":"(M173/Instructions!$C$25)*100","v":0},{"$f":"(N173/Instructions!$C$26)*100","v":0},{"$f":"(O173/Instructions!$C$27)*100","v":0},{"$f":"(U173/'Report Card'!$H$22)*100","v":{"$error":"#VALUE!"}},"----","E","E","E","E","E","--",null,null,null,null,null,{"$f":"Table_2[[#This Row],[Column51]]&Table_2[[#This Row],[Column52]]&AM175","v":""}]
[173,null,null,null,null,null,null,null,null,null,null,null,null,null,null,null,null,null,null,null,"--",0,null,null,{"$f":"(K174/Instructions!$C$23)*100","v":0},{"$f":"(L174/Instructions!$C$24)*100","v":0},{"$f":"(M174/Instructions!$C$25)*100","v":0},{"$f":"(N174/Instructions!$C$26)*100","v":0},{"$f":"(O174/Instructions!$C$27)*100","v":0},{"$f":"(U174/'Report Card'!$H$22)*100","v":{"$error":"#VALUE!"}},"----","E","E","E","E","E","--",null,null,null,null,null,{"$f":"Table_2[[#This Row],[Column51]]&Table_2[[#This Row],[Column52]]&AM176","v":""}]
[174,null,null,null,null,null,null,null,null,null,null,null,null,null,null,null,null,null,null,null,"--",0,null,null,{"$f":"(K175/Instructions!$C$23)*100","v":0},{"$f":"(L175/Instructions!$C$24)*100","v":0},{"$f":"(M175/Instructions!$C$25)*100","v":0},{"$f":"(N175/Instructions!$C$26)*100","v":0},{"$f":"(O175/Instructions!$C$27)*100","v":0},{"$f":"(U175/'Report Card'!$H$22)*100","v":{"$error":"#VALUE!"}},"----","E","E","E","E","E","--",null,null,null,null,null,{"$f":"Table_2[[#This Row],[Column51]]&Table_2[[#This Row],[Column52]]&AM177","v":""}]
[175,null,null,null,null,null,null,null,null,null,null,null,null,null,null,null,null,null,null,null,"--",0,null,null,{"$f":"(K176/Instructions!$C$23)*100","v":0},{"$f":"(L176/Instructions!$C$24)*100","v":0},{"$f":"(M176/Instructions!$C$25)*100","v":0},{"$f":"(N176/Instructions!$C$26)*100","v":0},{"$f":"(O176/Instructions!$C$27)*100","v":0},{"$f":"(U176/'Report Card'!$H$22)*100","v":{"$error":"#VALUE!"}},"----","E","E","E","E","E","--",null,null,null,null,null,{"$f":"Table_2[[#This Row],[Column51]]&Table_2[[#This Row],[Column52]]&AM178","v":""}]
[176,null,null,null,null,null,null,null,null,null,null,null,null,null,null,null,null,null,null,null,"--",0,null,null,{"$f":"(K177/Instructions!$C$23)*100","v":0},{"$f":"(L177/Instructions!$C$24)*100","v":0},{"$f":"(M177/Instructions!$C$25)*100","v":0},{"$f":"(N177/Instructions!$C$26)*100","v":0},{"$f":"(O177/Instructions!$C$27)*100","v":0},{"$f":"(U177/'Report Card'!$H$22)*100","v":{"$error":"#VALUE!"}},"----","E","E","E","E","E","--",null,null,null,null,null,{"$f":"Table_2[[#This Row],[Column51]]&Table_2[[#This Row],[Column52]]&AM179","v":""}]
[177,null,null,null,null,null,null,null,null,null,null,null,null,null,null,null,null,null,null,null,"--",0,null,null,{"$f":"(K178/Instructions!$C$23)*100","v":0},{"$f":"(L178/Instructions!$C$24)*100","v":0},{"$f":"(M178/Instructions!$C$25)*100","v":0},{"$f":"(N178/Instructions!$C$26)*100","v":0},{"$f":"(O178/Instructions!$C$27)*100","v":0},{"$f":"(U178/'Report Card'!$H$22)*100","v":{"$error":"#VALUE!"}},"----","E","E","E","E","E","--",null,null,null,null,null,{"$f":"Table_2[[#This Row],[Column51]]&Table_2[[#This Row],[Column52]]&AM180","v":""}]
[178,null,null,null,null,null,null,null,null,null,null,null,null,null,null,null,null,null,null,null,"--",0,null,null,{"$f":"(K179/Instructions!$C$23)*100","v":0},{"$f":"(L179/Instructions!$C$24)*100","v":0},{"$f":"(M179/Instructions!$C$25)*100","v":0},{"$f":"(N179/Instructions!$C$26)*100","v":0},{"$f":"(O179/Instructions!$C$27)*100","v":0},{"$f":"(U179/'Report Card'!$H$22)*100","v":{"$error":"#VALUE!"}},"----","E","E","E","E","E","--",null,null,null,null,null,{"$f":"Table_2[[#This Row],[Column51]]&Table_2[[#This Row],[Column52]]&AM181","v":""}]
[179,null,null,null,null,null,null,null,null,null,null,null,null,null,null,null,null,null,null,null,"--",0,null,null,{"$f":"(K180/Instructions!$C$23)*100","v":0},{"$f":"(L180/Instructions!$C$24)*100","v":0},{"$f":"(M180/Instructions!$C$25)*100","v":0},{"$f":"(N180/Instructions!$C$26)*100","v":0},{"$f":"(O180/Instructions!$C$27)*100","v":0},{"$f":"(U180/'Report Card'!$H$22)*100","v":{"$error":"#VALUE!"}},"----","E","E","E","E","E","--",null,null,null,null,null,{"$f":"Table_2[[#This Row],[Column51]]&Table_2[[#This Row],[Column52]]&AM182","v":""}]
[180,null,null,null,null,null,null,null,null,null,null,null,null,null,null,null,null,null,null,null,"--",0,null,null,{"$f":"(K181/Instructions!$C$23)*100","v":0},{"$f":"(L181/Instructions!$C$24)*100","v":0},{"$f":"(M181/Instructions!$C$25)*100","v":0},{"$f":"(N181/Instructions!$C$26)*100","v":0},{"$f":"(O181/Instructions!$C$27)*100","v":0},{"$f":"(U181/'Report Card'!$H$22)*100","v":{"$error":"#VALUE!"}},"----","E","E","E","E","E","--",null,null,null,null,null,{"$f":"Table_2[[#This Row],[Column51]]&Table_2[[#This Row],[Column52]]&AM183","v":""}]
[181,null,null,null,null,null,null,null,null,null,null,null,null,null,null,null,null,null,null,null,"--",0,null,null,{"$f":"(K182/Instructions!$C$23)*100","v":0},{"$f":"(L182/Instructions!$C$24)*100","v":0},{"$f":"(M182/Instructions!$C$25)*100","v":0},{"$f":"(N182/Instructions!$C$26)*100","v":0},{"$f":"(O182/Instructions!$C$27)*100","v":0},{"$f":"(U182/'Report Card'!$H$22)*100","v":{"$error":"#VALUE!"}},"----","E","E","E","E","E","--",null,null,null,null,null,{"$f":"Table_2[[#This Row],[Column51]]&Table_2[[#This Row],[Column52]]&AM184","v":""}]
[182,null,null,null,null,null,null,null,null,null,null,null,null,null,null,null,null,null,null,null,"--",0,null,null,{"$f":"(K183/Instructions!$C$23)*100","v":0},{"$f":"(L183/Instructions!$C$24)*100","v":0},{"$f":"(M183/Instructions!$C$25)*100","v":0},{"$f":"(N183/Instructions!$C$26)*100","v":0},{"$f":"(O183/Instructions!$C$27)*100","v":0},{"$f":"(U183/'Report Card'!$H$22)*100","v":{"$error":"#VALUE!"}},"----","E","E","E","E","E","--",null,null,null,null,null,{"$f":"Table_2[[#This Row],[Column51]]&Table_2[[#This Row],[Column52]]&AM185","v":""}]
[183,null,null,null,null,null,null,null,null,null,null,null,null,null,null,null,null,null,null,null,"--",0,null,null,{"$f":"(K184/Instructions!$C$23)*100","v":0},{"$f":"(L184/Instructions!$C$24)*100","v":0},{"$f":"(M184/Instructions!$C$25)*100","v":0},{"$f":"(N184/Instructions!$C$26)*100","v":0},{"$f":"(O184/Instructions!$C$27)*100","v":0},{"$f":"(U184/'Report Card'!$H$22)*100","v":{"$error":"#VALUE!"}},"----","E","E","E","E","E","--",null,null,null,null,null,{"$f":"Table_2[[#This Row],[Column51]]&Table_2[[#This Row],[Column52]]&AM186","v":""}]
[184,null,null,null,null,null,null,null,null,null,null,null,null,null,null,null,null,null,null,null,"--",0,null,null,{"$f":"(K185/Instructions!$C$23)*100","v":0},{"$f":"(L185/Instructions!$C$24)*100","v":0},{"$f":"(M185/Instructions!$C$25)*100","v":0},{"$f":"(N185/Instructions!$C$26)*100","v":0},{"$f":"(O185/Instructions!$C$27)*100","v":0},{"$f":"(U185/'Report Card'!$H$22)*100","v":{"$error":"#VALUE!"}},"----","E","E","E","E","E","--",null,null,null,null,null,{"$f":"Table_2[[#This Row],[Column51]]&Table_2[[#This Row],[Column52]]&AM187","v":""}]
[185,null,null,null,null,null,null,null,null,null,null,null,null,null,null,null,null,null,null,null,"--",0,null,null,{"$f":"(K186/Instructions!$C$23)*100","v":0},{"$f":"(L186/Instructions!$C$24)*100","v":0},{"$f":"(M186/Instructions!$C$25)*100","v":0},{"$f":"(N186/Instructions!$C$26)*100","v":0},{"$f":"(O186/Instructions!$C$27)*100","v":0},{"$f":"(U186/'Report Card'!$H$22)*100","v":{"$error":"#VALUE!"}},"----","E","E","E","E","E","--",null,null,null,null,null,{"$f":"Table_2[[#This Row],[Column51]]&Table_2[[#This Row],[Column52]]&AM188","v":""}]
[186,null,null,null,null,null,null,null,null,null,null,null,null,null,null,null,null,null,null,null,"--",0,null,null,{"$f":"(K187/Instructions!$C$23)*100","v":0},{"$f":"(L187/Instructions!$C$24)*100","v":0},{"$f":"(M187/Instructions!$C$25)*100","v":0},{"$f":"(N187/Instructions!$C$26)*100","v":0},{"$f":"(O187/Instructions!$C$27)*100","v":0},{"$f":"(U187/'Report Card'!$H$22)*100","v":{"$error":"#VALUE!"}},"----","E","E","E","E","E","--",null,null,null,null,null,{"$f":"Table_2[[#This Row],[Column51]]&Table_2[[#This Row],[Column52]]&AM189","v":""}]
[187,null,null,null,null,null,null,null,null,null,null,null,null,null,null,null,null,null,null,null,"--",0,null,null,{"$f":"(K188/Instructions!$C$23)*100","v":0},{"$f":"(L188/Instructions!$C$24)*100","v":0},{"$f":"(M188/Instructions!$C$25)*100","v":0},{"$f":"(N188/Instructions!$C$26)*100","v":0},{"$f":"(O188/Instructions!$C$27)*100","v":0},{"$f":"(U188/'Report Card'!$H$22)*100","v":{"$error":"#VALUE!"}},"----","E","E","E","E","E","--",null,null,null,null,null,{"$f":"Table_2[[#This Row],[Column51]]&Table_2[[#This Row],[Column52]]&AM190","v":""}]
[188,null,null,null,null,null,null,null,null,null,null,null,null,null,null,null,null,null,null,null,"--",0,null,null,{"$f":"(K189/Instructions!$C$23)*100","v":0},{"$f":"(L189/Instructions!$C$24)*100","v":0},{"$f":"(M189/Instructions!$C$25)*100","v":0},{"$f":"(N189/Instructions!$C$26)*100","v":0},{"$f":"(O189/Instructions!$C$27)*100","v":0},{"$f":"(U189/'Report Card'!$H$22)*100","v":{"$error":"#VALUE!"}},"----","E","E","E","E","E","--",null,null,null,null,null,{"$f":"Table_2[[#This Row],[Column51]]&Table_2[[#This Row],[Column52]]&AM191","v":""}]
[189,null,null,null,null,null,null,null,null,null,null,null,null,null,null,null,null,null,null,null,"--",0,null,null,{"$f":"(K190/Instructions!$C$23)*100","v":0},{"$f":"(L190/Instructions!$C$24)*100","v":0},{"$f":"(M190/Instructions!$C$25)*100","v":0},{"$f":"(N190/Instructions!$C$26)*100","v":0},{"$f":"(O190/Instructions!$C$27)*100","v":0},{"$f":"(U190/'Report Card'!$H$22)*100","v":{"$error":"#VALUE!"}},"----","E","E","E","E","E","--",null,null,null,null,null,{"$f":"Table_2[[#This Row],[Column51]]&Table_2[[#This Row],[Column52]]&AM192","v":""}]
[190,null,null,null,null,null,null,null,null,null,null,null,null,null,null,null,null,null,null,null,"--",0,null,null,{"$f":"(K191/Instructions!$C$23)*100","v":0},{"$f":"(L191/Instructions!$C$24)*100","v":0},{"$f":"(M191/Instructions!$C$25)*100","v":0},{"$f":"(N191/Instructions!$C$26)*100","v":0},{"$f":"(O191/Instructions!$C$27)*100","v":0},{"$f":"(U191/'Report Card'!$H$22)*100","v":{"$error":"#VALUE!"}},"----","E","E","E","E","E","--",null,null,null,null,null,{"$f":"Table_2[[#This Row],[Column51]]&Table_2[[#This Row],[Column52]]&AM193","v":""}]
[191,null,null,null,null,null,null,null,null,null,null,null,null,null,null,null,null,null,null,null,"--",0,null,null,{"$f":"(K192/Instructions!$C$23)*100","v":0},{"$f":"(L192/Instructions!$C$24)*100","v":0},{"$f":"(M192/Instructions!$C$25)*100","v":0},{"$f":"(N192/Instructions!$C$26)*100","v":0},{"$f":"(O192/Instructions!$C$27)*100","v":0},{"$f":"(U192/'Report Card'!$H$22)*100","v":{"$error":"#VALUE!"}},"----","E","E","E","E","E","--",null,null,null,null,null,{"$f":"Table_2[[#This Row],[Column51]]&Table_2[[#This Row],[Column52]]&AM194","v":""}]
[192,null,null,null,null,null,null,null,null,null,null,null,null,null,null,null,null,null,null,null,"--",0,null,null,{"$f":"(K193/Instructions!$C$23)*100","v":0},{"$f":"(L193/Instructions!$C$24)*100","v":0},{"$f":"(M193/Instructions!$C$25)*100","v":0},{"$f":"(N193/Instructions!$C$26)*100","v":0},{"$f":"(O193/Instructions!$C$27)*100","v":0},{"$f":"(U193/'Report Card'!$H$22)*100","v":{"$error":"#VALUE!"}},"----","E","E","E","E","E","--",null,null,null,null,null,{"$f":"Table_2[[#This Row],[Column51]]&Table_2[[#This Row],[Column52]]&AM195","v":""}]
[193,null,null,null,null,null,null,null,null,null,null,null,null,null,null,null,null,null,null,null,{"$f":"IF(MIN(Y194:AC194)>=33,SUM(K194:P194),\"--\")","v":"--"},0,null,null,{"$f":"(K194/Instructions!$C$23)*100","v":0},{"$f":"(L194/Instructions!$C$24)*100","v":0},{"$f":"(M194/Instructions!$C$25)*100","v":0},{"$f":"(N194/Instructions!$C$26)*100","v":0},{"$f":"(O194/Instructions!$C$27)*100","v":0},{"$f":"(U194/'Report Card'!$H$22)*100","v":{"$error":"#VALUE!"}},"----",{"$f":"IFERROR(IF(Y194>90,\"A+\",IF(Y194>80,\"A\",IF(Y194>70,\"B+\",IF(Y194>60,\"B\",IF(Y194>50,\"C+\",IF(Y194>40,\"C\",IF(Y194>=33,\"D\",\"E\"))))))),\"Abs\")","v":"E"},{"$f":"IFERROR(IF(Z194>90,\"A+\",IF(Z194>80,\"A\",IF(Z194>70,\"B+\",IF(Z194>60,\"B\",IF(Z194>50,\"C+\",IF(Z194>40,\"C\",IF(Z194>=33,\"D\",\"E\"))))))),\"Abs\")","v":"E"},{"$f":"IFERROR(IF(AA194>90,\"A+\",IF(AA194>80,\"A\",IF(AA194>70,\"B+\",IF(AA194>60,\"B\",IF(AA194>50,\"C+\",IF(AA194>40,\"C\",IF(AA194>=33,\"D\",\"E\"))))))),\"Abs\")","v":"E"},{"$f":"IFERROR(IF(AB194>90,\"A+\",IF(AB194>80,\"A\",IF(AB194>70,\"B+\",IF(AB194>60,\"B\",IF(AB194>50,\"C+\",IF(AB194>40,\"C\",IF(AB194>=33,\"D\",\"E\"))))))),\"Abs\")","v":"E"},{"$f":"IFERROR(IF(AC194>90,\"A+\",IF(AC194>80,\"A\",IF(AC194>70,\"B+\",IF(AC194>60,\"B\",IF(AC194>50,\"C+\",IF(AC194>40,\"C\",IF(AC194>=33,\"D\",\"E\"))))))),\"Abs\")","v":"E"},"--",null,null,null,null,null,{"$f":"Table_2[[#This Row],[Column51]]&Table_2[[#This Row],[Column52]]&AM196","v":""}]
[194,null,null,null,null,null,null,null,null,null,null,null,null,null,null,null,null,null,null,null,"--",{"$f":"IF(U195=\"--\",0,U195)","v":0},null,null,{"$f":"(K195/Instructions!$C$23)*100","v":0},{"$f":"(L195/Instructions!$C$24)*100","v":0},{"$f":"(M195/Instructions!$C$25)*100","v":0},{"$f":"(N195/Instructions!$C$26)*100","v":0},{"$f":"(O195/Instructions!$C$27)*100","v":0},{"$f":"(U195/'Report Card'!$H$22)*100","v":{"$error":"#VALUE!"}},{"$f":"IF(AND(Y195>=33,Z195>=33,AA195>=33,AB195>=33,AC195>=33),\"PASS\",\"----\")","v":"----"},"E","E","E","E","E",{"$f":"IFERROR(IF(AD195>90,\"A+\",IF(AD195>80,\"A\",IF(AD195>70,\"B+\",IF(AD195>60,\"B\",IF(AD195>50,\"C+\",IF(AD195>40,\"C\",IF(AD195>=33,\"D\",\"E\"))))))),\"--\")","v":"--"},null,null,null,null,null,{"$f":"Table_2[[#This Row],[Column51]]&Table_2[[#This Row],[Column52]]&AM197","v":""}]
[195,null,null,null,null,null,null,null,null,null,null,null,null,null,null,null,null,null,null,null,"--",0,null,null,{"$f":"(K196/Instructions!$C$23)*100","v":0},{"$f":"(L196/Instructions!$C$24)*100","v":0},{"$f":"(M196/Instructions!$C$25)*100","v":0},{"$f":"(N196/Instructions!$C$26)*100","v":0},{"$f":"(O196/Instructions!$C$27)*100","v":0},{"$f":"(U196/'Report Card'!$H$22)*100","v":{"$error":"#VALUE!"}},"----","E","E","E","E","E","--",null,null,null,null,null,{"$f":"Table_2[[#This Row],[Column51]]&Table_2[[#This Row],[Column52]]&AM198","v":""}]
[196,null,null,null,null,null,null,null,null,null,null,null,null,null,null,null,null,null,null,null,"--",0,null,null,{"$f":"(K197/Instructions!$C$23)*100","v":0},{"$f":"(L197/Instructions!$C$24)*100","v":0},{"$f":"(M197/Instructions!$C$25)*100","v":0},{"$f":"(N197/Instructions!$C$26)*100","v":0},{"$f":"(O197/Instructions!$C$27)*100","v":0},{"$f":"(U197/'Report Card'!$H$22)*100","v":{"$error":"#VALUE!"}},"----","E","E","E","E","E","--",null,null,null,null,null,{"$f":"Table_2[[#This Row],[Column51]]&Table_2[[#This Row],[Column52]]&AM199","v":""}]
[197,null,null,null,null,null,null,null,null,null,null,null,null,null,null,null,null,null,null,null,"--",0,null,null,{"$f":"(K198/Instructions!$C$23)*100","v":0},{"$f":"(L198/Instructions!$C$24)*100","v":0},{"$f":"(M198/Instructions!$C$25)*100","v":0},{"$f":"(N198/Instructions!$C$26)*100","v":0},{"$f":"(O198/Instructions!$C$27)*100","v":0},{"$f":"(U198/'Report Card'!$H$22)*100","v":{"$error":"#VALUE!"}},"----","E","E","E","E","E","--",null,null,null,null,null,{"$f":"Table_2[[#This Row],[Column51]]&Table_2[[#This Row],[Column52]]&AM200","v":""}]
[198,null,null,null,null,null,null,null,null,null,null,null,null,null,null,null,null,null,null,null,"--",0,null,null,{"$f":"(K199/Instructions!$C$23)*100","v":0},{"$f":"(L199/Instructions!$C$24)*100","v":0},{"$f":"(M199/Instructions!$C$25)*100","v":0},{"$f":"(N199/Instructions!$C$26)*100","v":0},{"$f":"(O199/Instructions!$C$27)*100","v":0},{"$f":"(U199/'Report Card'!$H$22)*100","v":{"$error":"#VALUE!"}},"----","E","E","E","E","E","--",null,null,null,null,null,{"$f":"Table_2[[#This Row],[Column51]]&Table_2[[#This Row],[Column52]]&AM201","v":""}]
[199,null,null,null,null,null,null,null,null,null,null,null,null,null,null,null,null,null,null,null,"--",0,null,null,{"$f":"(K200/Instructions!$C$23)*100","v":0},{"$f":"(L200/Instructions!$C$24)*100","v":0},{"$f":"(M200/Instructions!$C$25)*100","v":0},{"$f":"(N200/Instructions!$C$26)*100","v":0},{"$f":"(O200/Instructions!$C$27)*100","v":0},{"$f":"(U200/'Report Card'!$H$22)*100","v":{"$error":"#VALUE!"}},"----","E","E","E","E","E","--",null,null,null,null,null,{"$f":"Table_2[[#This Row],[Column51]]&Table_2[[#This Row],[Column52]]&AM202","v":""}]
[200,null,null,null,null,null,null,null,null,null,null,null,null,null,null,null,null,null,null,null,"--",0,null,null,{"$f":"(K201/Instructions!$C$23)*100","v":0},{"$f":"(L201/Instructions!$C$24)*100","v":0},{"$f":"(M201/Instructions!$C$25)*100","v":0},{"$f":"(N201/Instructions!$C$26)*100","v":0},{"$f":"(O201/Instructions!$C$27)*100","v":0},{"$f":"(U201/'Report Card'!$H$22)*100","v":{"$error":"#VALUE!"}},"----","E","E","E","E","E","--",null,null,null,null,null,{"$f":"Table_2[[#This Row],[Column51]]&Table_2[[#This Row],[Column52]]&AM203","v":""}]
[201,null,null,null,null,null,null,null,null,null,null,null,null,null,null,null,null,null,null,null,"--",0,null,null,{"$f":"(K202/Instructions!$C$23)*100","v":0},{"$f":"(L202/Instructions!$C$24)*100","v":0},{"$f":"(M202/Instructions!$C$25)*100","v":0},{"$f":"(N202/Instructions!$C$26)*100","v":0},{"$f":"(O202/Instructions!$C$27)*100","v":0},{"$f":"(U202/'Report Card'!$H$22)*100","v":{"$error":"#VALUE!"}},"----","E","E","E","E","E","--",null,null,null,null,null,{"$f":"Table_2[[#This Row],[Column51]]&Table_2[[#This Row],[Column52]]&AM204","v":""}]
[202,null,null,null,null,null,null,null,null,null,null,null,null,null,null,null,null,null,null,null,"--",0,null,null,{"$f":"(K203/Instructions!$C$23)*100","v":0},{"$f":"(L203/Instructions!$C$24)*100","v":0},{"$f":"(M203/Instructions!$C$25)*100","v":0},{"$f":"(N203/Instructions!$C$26)*100","v":0},{"$f":"(O203/Instructions!$C$27)*100","v":0},{"$f":"(U203/'Report Card'!$H$22)*100","v":{"$error":"#VALUE!"}},"----","E","E","E","E","E","--",null,null,null,null,null,{"$f":"Table_2[[#This Row],[Column51]]&Table_2[[#This Row],[Column52]]&AM205","v":""}]
[203,null,null,null,null,null,null,null,null,null,null,null,null,null,null,null,null,null,null,null,"--",0,null,null,{"$f":"(K204/Instructions!$C$23)*100","v":0},{"$f":"(L204/Instructions!$C$24)*100","v":0},{"$f":"(M204/Instructions!$C$25)*100","v":0},{"$f":"(N204/Instructions!$C$26)*100","v":0},{"$f":"(O204/Instructions!$C$27)*100","v":0},{"$f":"(U204/'Report Card'!$H$22)*100","v":{"$error":"#VALUE!"}},"----","E","E","E","E","E","--",null,null,null,null,null,{"$f":"Table_2[[#This Row],[Column51]]&Table_2[[#This Row],[Column52]]&AM206","v":""}]
[204,null,null,null,null,null,null,null,null,null,null,null,null,null,null,null,null,null,null,null,"--",0,null,null,{"$f":"(K205/Instructions!$C$23)*100","v":0},{"$f":"(L205/Instructions!$C$24)*100","v":0},{"$f":"(M205/Instructions!$C$25)*100","v":0},{"$f":"(N205/Instructions!$C$26)*100","v":0},{"$f":"(O205/Instructions!$C$27)*100","v":0},{"$f":"(U205/'Report Card'!$H$22)*100","v":{"$error":"#VALUE!"}},"----","E","E","E","E","E","--",null,null,null,null,null,{"$f":"Table_2[[#This Row],[Column51]]&Table_2[[#This Row],[Column52]]&AM207","v":""}]
[205,null,null,null,null,null,null,null,null,null,null,null,null,null,null,null,null,null,null,null,"--",0,null,null,{"$f":"(K206/Instructions!$C$23)*100","v":0},{"$f":"(L206/Instructions!$C$24)*100","v":0},{"$f":"(M206/Instructions!$C$25)*100","v":0},{"$f":"(N206/Instructions!$C$26)*100","v":0},{"$f":"(O206/Instructions!$C$27)*100","v":0},{"$f":"(U206/'Report Card'!$H$22)*100","v":{"$error":"#VALUE!"}},"----","E","E","E","E","E","--",null,null,null,null,null,{"$f":"Table_2[[#This Row],[Column51]]&Table_2[[#This Row],[Column52]]&AM208","v":""}]
[206,null,null,null,null,null,null,null,null,null,null,null,null,null,null,null,null,null,null,null,"--",0,null,null,{"$f":"(K207/Instructions!$C$23)*100","v":0},{"$f":"(L207/Instructions!$C$24)*100","v":0},{"$f":"(M207/Instructions!$C$25)*100","v":0},{"$f":"(N207/Instructions!$C$26)*100","v":0},{"$f":"(O207/Instructions!$C$27)*100","v":0},{"$f":"(U207/'Report Card'!$H$22)*100","v":{"$error":"#VALUE!"}},"----","E","E","E","E","E","--",null,null,null,null,null,{"$f":"Table_2[[#This Row],[Column51]]&Table_2[[#This Row],[Column52]]&AM209","v":""}]
[207,null,null,null,null,null,null,null,null,null,null,null,null,null,null,null,null,null,null,null,"--",0,null,null,{"$f":"(K208/Instructions!$C$23)*100","v":0},{"$f":"(L208/Instructions!$C$24)*100","v":0},{"$f":"(M208/Instructions!$C$25)*100","v":0},{"$f":"(N208/Instructions!$C$26)*100","v":0},{"$f":"(O208/Instructions!$C$27)*100","v":0},{"$f":"(U208/'Report Card'!$H$22)*100","v":{"$error":"#VALUE!"}},"----","E","E","E","E","E","--",null,null,null,null,null,{"$f":"Table_2[[#This Row],[Column51]]&Table_2[[#This Row],[Column52]]&AM210","v":""}]
[208,null,null,null,null,null,null,null,null,null,null,null,null,null,null,null,null,null,null,null,"--",0,null,null,{"$f":"(K209/Instructions!$C$23)*100","v":0},{"$f":"(L209/Instructions!$C$24)*100","v":0},{"$f":"(M209/Instructions!$C$25)*100","v":0},{"$f":"(N209/Instructions!$C$26)*100","v":0},{"$f":"(O209/Instructions!$C$27)*100","v":0},{"$f":"(U209/'Report Card'!$H$22)*100","v":{"$error":"#VALUE!"}},"----","E","E","E","E","E","--",null,null,null,null,null,{"$f":"Table_2[[#This Row],[Column51]]&Table_2[[#This Row],[Column52]]&AM211","v":""}]
[209,null,null,null,null,null,null,null,null,null,null,null,null,null,null,null,null,null,null,null,"--",0,null,null,{"$f":"(K210/Instructions!$C$23)*100","v":0},{"$f":"(L210/Instructions!$C$24)*100","v":0},{"$f":"(M210/Instructions!$C$25)*100","v":0},{"$f":"(N210/Instructions!$C$26)*100","v":0},{"$f":"(O210/Instructions!$C$27)*100","v":0},{"$f":"(U210/'Report Card'!$H$22)*100","v":{"$error":"#VALUE!"}},"----","E","E","E","E","E","--",null,null,null,null,null,{"$f":"Table_2[[#This Row],[Column51]]&Table_2[[#This Row],[Column52]]&AM212","v":""}]
[210,null,null,null,null,null,null,null,null,null,null,null,null,null,null,null,null,null,null,null,"--",0,null,null,{"$f":"(K211/Instructions!$C$23)*100","v":0},{"$f":"(L211/Instructions!$C$24)*100","v":0},{"$f":"(M211/Instructions!$C$25)*100","v":0},{"$f":"(N211/Instructions!$C$26)*100","v":0},{"$f":"(O211/Instructions!$C$27)*100","v":0},{"$f":"(U211/'Report Card'!$H$22)*100","v":{"$error":"#VALUE!"}},"----","E","E","E","E","E","--",null,null,null,null,null,{"$f":"Table_2[[#This Row],[Column51]]&Table_2[[#This Row],[Column52]]&AM213","v":""}]
[211,null,null,null,null,null,null,null,null,null,null,null,null,null,null,null,null,null,null,null,"--",0,null,null,{"$f":"(K212/Instructions!$C$23)*100","v":0},{"$f":"(L212/Instructions!$C$24)*100","v":0},{"$f":"(M212/Instructions!$C$25)*100","v":0},{"$f":"(N212/Instructions!$C$26)*100","v":0},{"$f":"(O212/Instructions!$C$27)*100","v":0},{"$f":"(U212/'Report Card'!$H$22)*100","v":{"$error":"#VALUE!"}},"----","E","E","E","E","E","--",null,null,null,null,null,{"$f":"Table_2[[#This Row],[Column51]]&Table_2[[#This Row],[Column52]]&AM214","v":""}]
[212,null,null,null,null,null,null,null,null,null,null,null,null,null,null,null,null,null,null,null,"--",0,null,null,{"$f":"(K213/Instructions!$C$23)*100","v":0},{"$f":"(L213/Instructions!$C$24)*100","v":0},{"$f":"(M213/Instructions!$C$25)*100","v":0},{"$f":"(N213/Instructions!$C$26)*100","v":0},{"$f":"(O213/Instructions!$C$27)*100","v":0},{"$f":"(U213/'Report Card'!$H$22)*100","v":{"$error":"#VALUE!"}},"----","E","E","E","E","E","--",null,null,null,null,null,{"$f":"Table_2[[#This Row],[Column51]]&Table_2[[#This Row],[Column52]]&AM215","v":""}]
[213,null,null,null,null,null,null,null,null,null,null,null,null,null,null,null,null,null,null,null,"--",0,null,null,{"$f":"(K214/Instructions!$C$23)*100","v":0},{"$f":"(L214/Instructions!$C$24)*100","v":0},{"$f":"(M214/Instructions!$C$25)*100","v":0},{"$f":"(N214/Instructions!$C$26)*100","v":0},{"$f":"(O214/Instructions!$C$27)*100","v":0},{"$f":"(U214/'Report Card'!$H$22)*100","v":{"$error":"#VALUE!"}},"----","E","E","E","E","E","--",null,null,null,null,null,{"$f":"Table_2[[#This Row],[Column51]]&Table_2[[#This Row],[Column52]]&AM216","v":""}]
[214,null,null,null,null,null,null,null,null,null,null,null,null,null,null,null,null,null,null,null,"--",0,null,null,{"$f":"(K215/Instructions!$C$23)*100","v":0},{"$f":"(L215/Instructions!$C$24)*100","v":0},{"$f":"(M215/Instructions!$C$25)*100","v":0},{"$f":"(N215/Instructions!$C$26)*100","v":0},{"$f":"(O215/Instructions!$C$27)*100","v":0},{"$f":"(U215/'Report Card'!$H$22)*100","v":{"$error":"#VALUE!"}},"----","E","E","E","E","E","--",null,null,null,null,null,{"$f":"Table_2[[#This Row],[Column51]]&Table_2[[#This Row],[Column52]]&AM217","v":""}]
[215,null,null,null,null,null,null,null,null,null,null,null,null,null,null,null,null,null,null,null,"--",0,null,null,{"$f":"(K216/Instructions!$C$23)*100","v":0},{"$f":"(L216/Instructions!$C$24)*100","v":0},{"$f":"(M216/Instructions!$C$25)*100","v":0},{"$f":"(N216/Instructions!$C$26)*100","v":0},{"$f":"(O216/Instructions!$C$27)*100","v":0},{"$f":"(U216/'Report Card'!$H$22)*100","v":{"$error":"#VALUE!"}},"----","E","E","E","E","E","--",null,null,null,null,null,{"$f":"Table_2[[#This Row],[Column51]]&Table_2[[#This Row],[Column52]]&AM218","v":""}]
[216,null,null,null,null,null,null,null,null,null,null,null,null,null,null,null,null,null,null,null,"--",0,null,null,{"$f":"(K217/Instructions!$C$23)*100","v":0},{"$f":"(L217/Instructions!$C$24)*100","v":0},{"$f":"(M217/Instructions!$C$25)*100","v":0},{"$f":"(N217/Instructions!$C$26)*100","v":0},{"$f":"(O217/Instructions!$C$27)*100","v":0},{"$f":"(U217/'Report Card'!$H$22)*100","v":{"$error":"#VALUE!"}},"----","E","E","E","E","E","--",null,null,null,null,null,{"$f":"Table_2[[#This Row],[Column51]]&Table_2[[#This Row],[Column52]]&AM219","v":""}]
[217,null,null,null,null,null,null,null,null,null,null,null,null,null,null,null,null,null,null,null,"--",0,null,null,{"$f":"(K218/Instructions!$C$23)*100","v":0},{"$f":"(L218/Instructions!$C$24)*100","v":0},{"$f":"(M218/Instructions!$C$25)*100","v":0},{"$f":"(N218/Instructions!$C$26)*100","v":0},{"$f":"(O218/Instructions!$C$27)*100","v":0},{"$f":"(U218/'Report Card'!$H$22)*100","v":{"$error":"#VALUE!"}},"----","E","E","E","E","E","--",null,null,null,null,null,{"$f":"Table_2[[#This Row],[Column51]]&Table_2[[#This Row],[Column52]]&AM220","v":""}]
[218,null,null,null,null,null,null,null,null,null,null,null,null,null,null,null,null,null,null,null,"--",0,null,null,{"$f":"(K219/Instructions!$C$23)*100","v":0},{"$f":"(L219/Instructions!$C$24)*100","v":0},{"$f":"(M219/Instructions!$C$25)*100","v":0},{"$f":"(N219/Instructions!$C$26)*100","v":0},{"$f":"(O219/Instructions!$C$27)*100","v":0},{"$f":"(U219/'Report Card'!$H$22)*100","v":{"$error":"#VALUE!"}},"----","E","E","E","E","E","--",null,null,null,null,null,{"$f":"Table_2[[#This Row],[Column51]]&Table_2[[#This Row],[Column52]]&AM221","v":""}]
[219,null,null,null,null,null,null,null,null,null,null,null,null,null,null,null,null,null,null,null,"--",0,null,null,{"$f":"(K220/Instructions!$C$23)*100","v":0},{"$f":"(L220/Instructions!$C$24)*100","v":0},{"$f":"(M220/Instructions!$C$25)*100","v":0},{"$f":"(N220/Instructions!$C$26)*100","v":0},{"$f":"(O220/Instructions!$C$27)*100","v":0},{"$f":"(U220/'Report Card'!$H$22)*100","v":{"$error":"#VALUE!"}},"----","E","E","E","E","E","--",null,null,null,null,null,{"$f":"Table_2[[#This Row],[Column51]]&Table_2[[#This Row],[Column52]]&AM222","v":""}]
[220,null,null,null,null,null,null,null,null,null,null,null,null,null,null,null,null,null,null,null,"--",0,null,null,{"$f":"(K221/Instructions!$C$23)*100","v":0},{"$f":"(L221/Instructions!$C$24)*100","v":0},{"$f":"(M221/Instructions!$C$25)*100","v":0},{"$f":"(N221/Instructions!$C$26)*100","v":0},{"$f":"(O221/Instructions!$C$27)*100","v":0},{"$f":"(U221/'Report Card'!$H$22)*100","v":{"$error":"#VALUE!"}},"----","E","E","E","E","E","--",null,null,null,null,null,{"$f":"Table_2[[#This Row],[Column51]]&Table_2[[#This Row],[Column52]]&AM223","v":""}]
[221,null,null,null,null,null,null,null,null,null,null,null,null,null,null,null,null,null,null,null,"--",0,null,null,{"$f":"(K222/Instructions!$C$23)*100","v":0},{"$f":"(L222/Instructions!$C$24)*100","v":0},{"$f":"(M222/Instructions!$C$25)*100","v":0},{"$f":"(N222/Instructions!$C$26)*100","v":0},{"$f":"(O222/Instructions!$C$27)*100","v":0},{"$f":"(U222/'Report Card'!$H$22)*100","v":{"$error":"#VALUE!"}},"----","E","E","E","E","E","--",null,null,null,null,null,{"$f":"Table_2[[#This Row],[Column51]]&Table_2[[#This Row],[Column52]]&AM224","v":""}]
[222,null,null,null,null,null,null,null,null,null,null,null,null,null,null,null,null,null,null,null,"--",0,null,null,{"$f":"(K223/Instructions!$C$23)*100","v":0},{"$f":"(L223/Instructions!$C$24)*100","v":0},{"$f":"(M223/Instructions!$C$25)*100","v":0},{"$f":"(N223/Instructions!$C$26)*100","v":0},{"$f":"(O223/Instructions!$C$27)*100","v":0},{"$f":"(U223/'Report Card'!$H$22)*100","v":{"$error":"#VALUE!"}},"----","E","E","E","E","E","--",null,null,null,null,null,{"$f":"Table_2[[#This Row],[Column51]]&Table_2[[#This Row],[Column52]]&AM225","v":""}]
[223,null,null,null,null,null,null,null,null,null,null,null,null,null,null,null,null,null,null,null,"--",0,null,null,{"$f":"(K224/Instructions!$C$23)*100","v":0},{"$f":"(L224/Instructions!$C$24)*100","v":0},{"$f":"(M224/Instructions!$C$25)*100","v":0},{"$f":"(N224/Instructions!$C$26)*100","v":0},{"$f":"(O224/Instructions!$C$27)*100","v":0},{"$f":"(U224/'Report Card'!$H$22)*100","v":{"$error":"#VALUE!"}},"----","E","E","E","E","E","--",null,null,null,null,null,{"$f":"Table_2[[#This Row],[Column51]]&Table_2[[#This Row],[Column52]]&AM226","v":""}]
[224,null,null,null,null,null,null,null,null,null,null,null,null,null,null,null,null,null,null,null,"--",0,null,null,{"$f":"(K225/Instructions!$C$23)*100","v":0},{"$f":"(L225/Instructions!$C$24)*100","v":0},{"$f":"(M225/Instructions!$C$25)*100","v":0},{"$f":"(N225/Instructions!$C$26)*100","v":0},{"$f":"(O225/Instructions!$C$27)*100","v":0},{"$f":"(U225/'Report Card'!$H$22)*100","v":{"$error":"#VALUE!"}},"----","E","E","E","E","E","--",null,null,null,null,null,{"$f":"Table_2[[#This Row],[Column51]]&Table_2[[#This Row],[Column52]]&AM227","v":""}]
[225,null,null,null,null,null,null,null,null,null,null,null,null,null,null,null,null,null,null,null,"--",0,null,null,{"$f":"(K226/Instructions!$C$23)*100","v":0},{"$f":"(L226/Instructions!$C$24)*100","v":0},{"$f":"(M226/Instructions!$C$25)*100","v":0},{"$f":"(N226/Instructions!$C$26)*100","v":0},{"$f":"(O226/Instructions!$C$27)*100","v":0},{"$f":"(U226/'Report Card'!$H$22)*100","v":{"$error":"#VALUE!"}},"----","E","E","E","E","E","--",null,null,null,null,null,{"$f":"Table_2[[#This Row],[Column51]]&Table_2[[#This Row],[Column52]]&AM228","v":""}]
[226,null,null,null,null,null,null,null,null,null,null,null,null,null,null,null,null,null,null,null,"--",0,null,null,{"$f":"(K227/Instructions!$C$23)*100","v":0},{"$f":"(L227/Instructions!$C$24)*100","v":0},{"$f":"(M227/Instructions!$C$25)*100","v":0},{"$f":"(N227/Instructions!$C$26)*100","v":0},{"$f":"(O227/Instructions!$C$27)*100","v":0},{"$f":"(U227/'Report Card'!$H$22)*100","v":{"$error":"#VALUE!"}},"----","E","E","E","E","E","--",null,null,null,null,null,{"$f":"Table_2[[#This Row],[Column51]]&Table_2[[#This Row],[Column52]]&AM229","v":""}]
[227,null,null,null,null,null,null,null,null,null,null,null,null,null,null,null,null,null,null,null,"--",0,null,null,{"$f":"(K228/Instructions!$C$23)*100","v":0},{"$f":"(L228/Instructions!$C$24)*100","v":0},{"$f":"(M228/Instructions!$C$25)*100","v":0},{"$f":"(N228/Instructions!$C$26)*100","v":0},{"$f":"(O228/Instructions!$C$27)*100","v":0},{"$f":"(U228/'Report Card'!$H$22)*100","v":{"$error":"#VALUE!"}},"----","E","E","E","E","E","--",null,null,null,null,null,{"$f":"Table_2[[#This Row],[Column51]]&Table_2[[#This Row],[Column52]]&AM230","v":""}]
[228,null,null,null,null,null,null,null,null,null,null,null,null,null,null,null,null,null,null,null,"--",0,null,null,{"$f":"(K229/Instructions!$C$23)*100","v":0},{"$f":"(L229/Instructions!$C$24)*100","v":0},{"$f":"(M229/Instructions!$C$25)*100","v":0},{"$f":"(N229/Instructions!$C$26)*100","v":0},{"$f":"(O229/Instructions!$C$27)*100","v":0},{"$f":"(U229/'Report Card'!$H$22)*100","v":{"$error":"#VALUE!"}},"----","E","E","E","E","E","--",null,null,null,null,null,{"$f":"Table_2[[#This Row],[Column51]]&Table_2[[#This Row],[Column52]]&AM231","v":""}]
[229,null,null,null,null,null,null,null,null,null,null,null,null,null,null,null,null,null,null,null,"--",0,null,null,{"$f":"(K230/Instructions!$C$23)*100","v":0},{"$f":"(L230/Instructions!$C$24)*100","v":0},{"$f":"(M230/Instructions!$C$25)*100","v":0},{"$f":"(N230/Instructions!$C$26)*100","v":0},{"$f":"(O230/Instructions!$C$27)*100","v":0},{"$f":"(U230/'Report Card'!$H$22)*100","v":{"$error":"#VALUE!"}},"----","E","E","E","E","E","--",null,null,null,null,null,{"$f":"Table_2[[#This Row],[Column51]]&Table_2[[#This Row],[Column52]]&AM232","v":""}]
[230,null,null,null,null,null,null,null,null,null,null,null,null,null,null,null,null,null,null,null,"--",0,null,null,{"$f":"(K231/Instructions!$C$23)*100","v":0},{"$f":"(L231/Instructions!$C$24)*100","v":0},{"$f":"(M231/Instructions!$C$25)*100","v":0},{"$f":"(N231/Instructions!$C$26)*100","v":0},{"$f":"(O231/Instructions!$C$27)*100","v":0},{"$f":"(U231/'Report Card'!$H$22)*100","v":{"$error":"#VALUE!"}},"----","E","E","E","E","E","--",null,null,null,null,null,{"$f":"Table_2[[#This Row],[Column51]]&Table_2[[#This Row],[Column52]]&AM233","v":""}]
[231,null,null,null,null,null,null,null,null,null,null,null,null,null,null,null,null,null,null,null,"--",0,null,null,{"$f":"(K232/Instructions!$C$23)*100","v":0},{"$f":"(L232/Instructions!$C$24)*100","v":0},{"$f":"(M232/Instructions!$C$25)*100","v":0},{"$f":"(N232/Instructions!$C$26)*100","v":0},{"$f":"(O232/Instructions!$C$27)*100","v":0},{"$f":"(U232/'Report Card'!$H$22)*100","v":{"$error":"#VALUE!"}},"----","E","E","E","E","E","--",null,null,null,null,null,{"$f":"Table_2[[#This Row],[Column51]]&Table_2[[#This Row],[Column52]]&AM234","v":""}]
[232,null,null,null,null,null,null,null,null,null,null,null,null,null,null,null,null,null,null,null,"--",0,null,null,{"$f":"(K233/Instructions!$C$23)*100","v":0},{"$f":"(L233/Instructions!$C$24)*100","v":0},{"$f":"(M233/Instructions!$C$25)*100","v":0},{"$f":"(N233/Instructions!$C$26)*100","v":0},{"$f":"(O233/Instructions!$C$27)*100","v":0},{"$f":"(U233/'Report Card'!$H$22)*100","v":{"$error":"#VALUE!"}},"----","E","E","E","E","E","--",null,null,null,null,null,{"$f":"Table_2[[#This Row],[Column51]]&Table_2[[#This Row],[Column52]]&AM235","v":""}]
[233,null,null,null,null,null,null,null,null,null,null,null,null,null,null,null,null,null,null,null,"--",0,null,null,{"$f":"(K234/Instructions!$C$23)*100","v":0},{"$f":"(L234/Instructions!$C$24)*100","v":0},{"$f":"(M234/Instructions!$C$25)*100","v":0},{"$f":"(N234/Instructions!$C$26)*100","v":0},{"$f":"(O234/Instructions!$C$27)*100","v":0},{"$f":"(U234/'Report Card'!$H$22)*100","v":{"$error":"#VALUE!"}},"----","E","E","E","E","E","--",null,null,null,null,null,{"$f":"Table_2[[#This Row],[Column51]]&Table_2[[#This Row],[Column52]]&AM236","v":""}]
[234,null,null,null,null,null,null,null,null,null,null,null,null,null,null,null,null,null,null,null,"--",0,null,null,{"$f":"(K235/Instructions!$C$23)*100","v":0},{"$f":"(L235/Instructions!$C$24)*100","v":0},{"$f":"(M235/Instructions!$C$25)*100","v":0},{"$f":"(N235/Instructions!$C$26)*100","v":0},{"$f":"(O235/Instructions!$C$27)*100","v":0},{"$f":"(U235/'Report Card'!$H$22)*100","v":{"$error":"#VALUE!"}},"----","E","E","E","E","E","--",null,null,null,null,null,{"$f":"Table_2[[#This Row],[Column51]]&Table_2[[#This Row],[Column52]]&AM237","v":""}]
[235,null,null,null,null,null,null,null,null,null,null,null,null,null,null,null,null,null,null,null,"--",0,null,null,{"$f":"(K236/Instructions!$C$23)*100","v":0},{"$f":"(L236/Instructions!$C$24)*100","v":0},{"$f":"(M236/Instructions!$C$25)*100","v":0},{"$f":"(N236/Instructions!$C$26)*100","v":0},{"$f":"(O236/Instructions!$C$27)*100","v":0},{"$f":"(U236/'Report Card'!$H$22)*100","v":{"$error":"#VALUE!"}},"----","E","E","E","E","E","--",null,null,null,null,null,{"$f":"Table_2[[#This Row],[Column51]]&Table_2[[#This Row],[Column52]]&AM238","v":""}]
[236,null,null,null,null,null,null,null,null,null,null,null,null,null,null,null,null,null,null,null,"--",0,null,null,{"$f":"(K237/Instructions!$C$23)*100","v":0},{"$f":"(L237/Instructions!$C$24)*100","v":0},{"$f":"(M237/Instructions!$C$25)*100","v":0},{"$f":"(N237/Instructions!$C$26)*100","v":0},{"$f":"(O237/Instructions!$C$27)*100","v":0},{"$f":"(U237/'Report Card'!$H$22)*100","v":{"$error":"#VALUE!"}},"----","E","E","E","E","E","--",null,null,null,null,null,{"$f":"Table_2[[#This Row],[Column51]]&Table_2[[#This Row],[Column52]]&AM239","v":""}]
[237,null,null,null,null,null,null,null,null,null,null,null,null,null,null,null,null,null,null,null,"--",0,null,null,{"$f":"(K238/Instructions!$C$23)*100","v":0},{"$f":"(L238/Instructions!$C$24)*100","v":0},{"$f":"(M238/Instructions!$C$25)*100","v":0},{"$f":"(N238/Instructions!$C$26)*100","v":0},{"$f":"(O238/Instructions!$C$27)*100","v":0},{"$f":"(U238/'Report Card'!$H$22)*100","v":{"$error":"#VALUE!"}},"----","E","E","E","E","E","--",null,null,null,null,null,{"$f":"Table_2[[#This Row],[Column51]]&Table_2[[#This Row],[Column52]]&AM240","v":""}]
[238,null,null,null,null,null,null,null,null,null,null,null,null,null,null,null,null,null,null,null,"--",0,null,null,{"$f":"(K239/Instructions!$C$23)*100","v":0},{"$f":"(L239/Instructions!$C$24)*100","v":0},{"$f":"(M239/Instructions!$C$25)*100","v":0},{"$f":"(N239/Instructions!$C$26)*100","v":0},{"$f":"(O239/Instructions!$C$27)*100","v":0},{"$f":"(U239/'Report Card'!$H$22)*100","v":{"$error":"#VALUE!"}},"----","E","E","E","E","E","--",null,null,null,null,null,{"$f":"Table_2[[#This Row],[Column51]]&Table_2[[#This Row],[Column52]]&AM241","v":""}]
[239,null,null,null,null,null,null,null,null,null,null,null,null,null,null,null,null,null,null,null,"--",0,null,null,{"$f":"(K240/Instructions!$C$23)*100","v":0},{"$f":"(L240/Instructions!$C$24)*100","v":0},{"$f":"(M240/Instructions!$C$25)*100","v":0},{"$f":"(N240/Instructions!$C$26)*100","v":0},{"$f":"(O240/Instructions!$C$27)*100","v":0},{"$f":"(U240/'Report Card'!$H$22)*100","v":{"$error":"#VALUE!"}},"----","E","E","E","E","E","--",null,null,null,null,null,{"$f":"Table_2[[#This Row],[Column51]]&Table_2[[#This Row],[Column52]]&AM242","v":""}]
[240,null,null,null,null,null,null,null,null,null,null,null,null,null,null,null,null,null,null,null,"--",0,null,null,{"$f":"(K241/Instructions!$C$23)*100","v":0},{"$f":"(L241/Instructions!$C$24)*100","v":0},{"$f":"(M241/Instructions!$C$25)*100","v":0},{"$f":"(N241/Instructions!$C$26)*100","v":0},{"$f":"(O241/Instructions!$C$27)*100","v":0},{"$f":"(U241/'Report Card'!$H$22)*100","v":{"$error":"#VALUE!"}},"----","E","E","E","E","E","--",null,null,null,null,null,{"$f":"Table_2[[#This Row],[Column51]]&Table_2[[#This Row],[Column52]]&AM243","v":""}]
[241,null,null,null,null,null,null,null,null,null,null,null,null,null,null,null,null,null,null,null,"--",0,null,null,{"$f":"(K242/Instructions!$C$23)*100","v":0},{"$f":"(L242/Instructions!$C$24)*100","v":0},{"$f":"(M242/Instructions!$C$25)*100","v":0},{"$f":"(N242/Instructions!$C$26)*100","v":0},{"$f":"(O242/Instructions!$C$27)*100","v":0},{"$f":"(U242/'Report Card'!$H$22)*100","v":{"$error":"#VALUE!"}},"----","E","E","E","E","E","--",null,null,null,null,null,{"$f":"Table_2[[#This Row],[Column51]]&Table_2[[#This Row],[Column52]]&AM244","v":""}]
[242,null,null,null,null,null,null,null,null,null,null,null,null,null,null,null,null,null,null,null,"--",0,null,null,{"$f":"(K243/Instructions!$C$23)*100","v":0},{"$f":"(L243/Instructions!$C$24)*100","v":0},{"$f":"(M243/Instructions!$C$25)*100","v":0},{"$f":"(N243/Instructions!$C$26)*100","v":0},{"$f":"(O243/Instructions!$C$27)*100","v":0},{"$f":"(U243/'Report Card'!$H$22)*100","v":{"$error":"#VALUE!"}},"----","E","E","E","E","E","--",null,null,null,null,null,{"$f":"Table_2[[#This Row],[Column51]]&Table_2[[#This Row],[Column52]]&AM245","v":""}]
[243,null,null,null,null,null,null,null,null,null,null,null,null,null,null,null,null,null,null,null,"--",0,null,null,{"$f":"(K244/Instructions!$C$23)*100","v":0},{"$f":"(L244/Instructions!$C$24)*100","v":0},{"$f":"(M244/Instructions!$C$25)*100","v":0},{"$f":"(N244/Instructions!$C$26)*100","v":0},{"$f":"(O244/Instructions!$C$27)*100","v":0},{"$f":"(U244/'Report Card'!$H$22)*100","v":{"$error":"#VALUE!"}},"----","E","E","E","E","E","--",null,null,null,null,null,{"$f":"Table_2[[#This Row],[Column51]]&Table_2[[#This Row],[Column52]]&AM246","v":""}]
[244,null,null,null,null,null,null,null,null,null,null,null,null,null,null,null,null,null,null,null,"--",0,null,null,{"$f":"(K245/Instructions!$C$23)*100","v":0},{"$f":"(L245/Instructions!$C$24)*100","v":0},{"$f":"(M245/Instructions!$C$25)*100","v":0},{"$f":"(N245/Instructions!$C$26)*100","v":0},{"$f":"(O245/Instructions!$C$27)*100","v":0},{"$f":"(U245/'Report Card'!$H$22)*100","v":{"$error":"#VALUE!"}},"----","E","E","E","E","E","--",null,null,null,null,null,{"$f":"Table_2[[#This Row],[Column51]]&Table_2[[#This Row],[Column52]]&AM247","v":""}]
[245,null,null,null,null,null,null,null,null,null,null,null,null,null,null,null,null,null,null,null,"--",0,null,null,{"$f":"(K246/Instructions!$C$23)*100","v":0},{"$f":"(L246/Instructions!$C$24)*100","v":0},{"$f":"(M246/Instructions!$C$25)*100","v":0},{"$f":"(N246/Instructions!$C$26)*100","v":0},{"$f":"(O246/Instructions!$C$27)*100","v":0},{"$f":"(U246/'Report Card'!$H$22)*100","v":{"$error":"#VALUE!"}},"----","E","E","E","E","E","--",null,null,null,null,null,{"$f":"Table_2[[#This Row],[Column51]]&Table_2[[#This Row],[Column52]]&AM248","v":""}]
[246,null,null,null,null,null,null,null,null,null,null,null,null,null,null,null,null,null,null,null,"--",0,null,null,{"$f":"(K247/Instructions!$C$23)*100","v":0},{"$f":"(L247/Instructions!$C$24)*100","v":0},{"$f":"(M247/Instructions!$C$25)*100","v":0},{"$f":"(N247/Instructions!$C$26)*100","v":0},{"$f":"(O247/Instructions!$C$27)*100","v":0},{"$f":"(U247/'Report Card'!$H$22)*100","v":{"$error":"#VALUE!"}},"----","E","E","E","E","E","--",null,null,null,null,null,{"$f":"Table_2[[#This Row],[Column51]]&Table_2[[#This Row],[Column52]]&AM249","v":""}]
[247,null,null,null,null,null,null,null,null,null,null,null,null,null,null,null,null,null,null,null,"--",0,null,null,{"$f":"(K248/Instructions!$C$23)*100","v":0},{"$f":"(L248/Instructions!$C$24)*100","v":0},{"$f":"(M248/Instructions!$C$25)*100","v":0},{"$f":"(N248/Instructions!$C$26)*100","v":0},{"$f":"(O248/Instructions!$C$27)*100","v":0},{"$f":"(U248/'Report Card'!$H$22)*100","v":{"$error":"#VALUE!"}},"----","E","E","E","E","E","--",null,null,null,null,null,{"$f":"Table_2[[#This Row],[Column51]]&Table_2[[#This Row],[Column52]]&AM250","v":""}]
[248,null,null,null,null,null,null,null,null,null,null,null,null,null,null,null,null,null,null,null,"--",0,null,null,{"$f":"(K249/Instructions!$C$23)*100","v":0},{"$f":"(L249/Instructions!$C$24)*100","v":0},{"$f":"(M249/Instructions!$C$25)*100","v":0},{"$f":"(N249/Instructions!$C$26)*100","v":0},{"$f":"(O249/Instructions!$C$27)*100","v":0},{"$f":"(U249/'Report Card'!$H$22)*100","v":{"$error":"#VALUE!"}},"----","E","E","E","E","E","--",null,null,null,null,null,{"$f":"Table_2[[#This Row],[Column51]]&Table_2[[#This Row],[Column52]]&AM251","v":""}]
[249,null,null,null,null,null,null,null,null,null,null,null,null,null,null,null,null,null,null,null,"--",0,null,null,{"$f":"(K250/Instructions!$C$23)*100","v":0},{"$f":"(L250/Instructions!$C$24)*100","v":0},{"$f":"(M250/Instructions!$C$25)*100","v":0},{"$f":"(N250/Instructions!$C$26)*100","v":0},{"$f":"(O250/Instructions!$C$27)*100","v":0},{"$f":"(U250/'Report Card'!$H$22)*100","v":{"$error":"#VALUE!"}},"----","E","E","E","E","E","--",null,null,null,null,null,{"$f":"Table_2[[#This Row],[Column51]]&Table_2[[#This Row],[Column52]]&AM252","v":""}]
[250,null,null,null,null,null,null,null,null,null,null,null,null,null,null,null,null,null,null,null,"--",0,null,null,{"$f":"(K251/Instructions!$C$23)*100","v":0},{"$f":"(L251/Instructions!$C$24)*100","v":0},{"$f":"(M251/Instructions!$C$25)*100","v":0},{"$f":"(N251/Instructions!$C$26)*100","v":0},{"$f":"(O251/Instructions!$C$27)*100","v":0},{"$f":"(U251/'Report Card'!$H$22)*100","v":{"$error":"#VALUE!"}},"----","E","E","E","E","E","--",null,null,null,null,null,{"$f":"Table_2[[#This Row],[Column51]]&Table_2[[#This Row],[Column52]]&AM253","v":""}]
[251,null,null,null,null,null,null,null,null,null,null,null,null,null,null,null,null,null,null,null,"--",0,null,null,{"$f":"(K252/Instructions!$C$23)*100","v":0},{"$f":"(L252/Instructions!$C$24)*100","v":0},{"$f":"(M252/Instructions!$C$25)*100","v":0},{"$f":"(N252/Instructions!$C$26)*100","v":0},{"$f":"(O252/Instructions!$C$27)*100","v":0},{"$f":"(U252/'Report Card'!$H$22)*100","v":{"$error":"#VALUE!"}},"----","E","E","E","E","E","--",null,null,null,null,null,{"$f":"Table_2[[#This Row],[Column51]]&Table_2[[#This Row],[Column52]]&AM254","v":""}]
[252,null,null,null,null,null,null,null,null,null,null,null,null,null,null,null,null,null,null,null,"--",0,null,null,{"$f":"(K253/Instructions!$C$23)*100","v":0},{"$f":"(L253/Instructions!$C$24)*100","v":0},{"$f":"(M253/Instructions!$C$25)*100","v":0},{"$f":"(N253/Instructions!$C$26)*100","v":0},{"$f":"(O253/Instructions!$C$27)*100","v":0},{"$f":"(U253/'Report Card'!$H$22)*100","v":{"$error":"#VALUE!"}},"----","E","E","E","E","E","--",null,null,null,null,null,{"$f":"Table_2[[#This Row],[Column51]]&Table_2[[#This Row],[Column52]]&AM255","v":""}]
[253,null,null,null,null,null,null,null,null,null,null,null,null,null,null,null,null,null,null,null,"--",0,null,null,{"$f":"(K254/Instructions!$C$23)*100","v":0},{"$f":"(L254/Instructions!$C$24)*100","v":0},{"$f":"(M254/Instructions!$C$25)*100","v":0},{"$f":"(N254/Instructions!$C$26)*100","v":0},{"$f":"(O254/Instructions!$C$27)*100","v":0},{"$f":"(U254/'Report Card'!$H$22)*100","v":{"$error":"#VALUE!"}},"----","E","E","E","E","E","--",null,null,null,null,null,{"$f":"Table_2[[#This Row],[Column51]]&Table_2[[#This Row],[Column52]]&AM256","v":""}]
[254,null,null,null,null,null,null,null,null,null,null,null,null,null,null,null,null,null,null,null,"--",0,null,null,{"$f":"(K255/Instructions!$C$23)*100","v":0},{"$f":"(L255/Instructions!$C$24)*100","v":0},{"$f":"(M255/Instructions!$C$25)*100","v":0},{"$f":"(N255/Instructions!$C$26)*100","v":0},{"$f":"(O255/Instructions!$C$27)*100","v":0},{"$f":"(U255/'Report Card'!$H$22)*100","v":{"$error":"#VALUE!"}},"----","E","E","E","E","E","--",null,null,null,null,null,{"$f":"Table_2[[#This Row],[Column51]]&Table_2[[#This Row],[Column52]]&AM257","v":""}]
[255,null,null,null,null,null,null,null,null,null,null,null,null,null,null,null,null,null,null,null,"--",0,null,null,{"$f":"(K256/Instructions!$C$23)*100","v":0},{"$f":"(L256/Instructions!$C$24)*100","v":0},{"$f":"(M256/Instructions!$C$25)*100","v":0},{"$f":"(N256/Instructions!$C$26)*100","v":0},{"$f":"(O256/Instructions!$C$27)*100","v":0},{"$f":"(U256/'Report Card'!$H$22)*100","v":{"$error":"#VALUE!"}},"----","E","E","E","E","E","--",null,null,null,null,null,{"$f":"Table_2[[#This Row],[Column51]]&Table_2[[#This Row],[Column52]]&AM258","v":""}]
[256,null,null,null,null,null,null,null,null,null,null,null,null,null,null,null,null,null,null,null,"--",0,null,null,{"$f":"(K257/Instructions!$C$23)*100","v":0},{"$f":"(L257/Instructions!$C$24)*100","v":0},{"$f":"(M257/Instructions!$C$25)*100","v":0},{"$f":"(N257/Instructions!$C$26)*100","v":0},{"$f":"(O257/Instructions!$C$27)*100","v":0},{"$f":"(U257/'Report Card'!$H$22)*100","v":{"$error":"#VALUE!"}},"----","E","E","E","E","E","--",null,null,null,null,null,{"$f":"Table_2[[#This Row],[Column51]]&Table_2[[#This Row],[Column52]]&AM259","v":""}]
[257,null,null,null,null,null,null,null,null,null,null,null,null,null,null,null,null,null,null,null,{"$f":"IF(MIN(Y258:AC258)>=33,SUM(K258:P258),\"--\")","v":"--"},0,null,null,{"$f":"(K258/Instructions!$C$23)*100","v":0},{"$f":"(L258/Instructions!$C$24)*100","v":0},{"$f":"(M258/Instructions!$C$25)*100","v":0},{"$f":"(N258/Instructions!$C$26)*100","v":0},{"$f":"(O258/Instructions!$C$27)*100","v":0},{"$f":"(U258/'Report Card'!$H$22)*100","v":{"$error":"#VALUE!"}},"----",{"$f":"IFERROR(IF(Y258>90,\"A+\",IF(Y258>80,\"A\",IF(Y258>70,\"B+\",IF(Y258>60,\"B\",IF(Y258>50,\"C+\",IF(Y258>40,\"C\",IF(Y258>=33,\"D\",\"E\"))))))),\"Abs\")","v":"E"},{"$f":"IFERROR(IF(Z258>90,\"A+\",IF(Z258>80,\"A\",IF(Z258>70,\"B+\",IF(Z258>60,\"B\",IF(Z258>50,\"C+\",IF(Z258>40,\"C\",IF(Z258>=33,\"D\",\"E\"))))))),\"Abs\")","v":"E"},{"$f":"IFERROR(IF(AA258>90,\"A+\",IF(AA258>80,\"A\",IF(AA258>70,\"B+\",IF(AA258>60,\"B\",IF(AA258>50,\"C+\",IF(AA258>40,\"C\",IF(AA258>=33,\"D\",\"E\"))))))),\"Abs\")","v":"E"},{"$f":"IFERROR(IF(AB258>90,\"A+\",IF(AB258>80,\"A\",IF(AB258>70,\"B+\",IF(AB258>60,\"B\",IF(AB258>50,\"C+\",IF(AB258>40,\"C\",IF(AB258>=33,\"D\",\"E\"))))))),\"Abs\")","v":"E"},{"$f":"IFERROR(IF(AC258>90,\"A+\",IF(AC258>80,\"A\",IF(AC258>70,\"B+\",IF(AC258>60,\"B\",IF(AC258>50,\"C+\",IF(AC258>40,\"C\",IF(AC258>=33,\"D\",\"E\"))))))),\"Abs\")","v":"E"},"--",null,null,null,null,null,{"$f":"Table_2[[#This Row],[Column51]]&Table_2[[#This Row],[Column52]]&AM260","v":""}]
[258,null,null,null,null,null,null,null,null,null,null,null,null,null,null,null,null,null,null,null,"--",{"$f":"IF(U259=\"--\",0,U259)","v":0},null,null,{"$f":"(K259/Instructions!$C$23)*100","v":0},{"$f":"(L259/Instructions!$C$24)*100","v":0},{"$f":"(M259/Instructions!$C$25)*100","v":0},{"$f":"(N259/Instructions!$C$26)*100","v":0},{"$f":"(O259/Instructions!$C$27)*100","v":0},{"$f":"(U259/'Report Card'!$H$22)*100","v":{"$error":"#VALUE!"}},{"$f":"IF(AND(Y259>=33,Z259>=33,AA259>=33,AB259>=33,AC259>=33),\"PASS\",\"----\")","v":"----"},"E","E","E","E","E",{"$f":"IFERROR(IF(AD259>90,\"A+\",IF(AD259>80,\"A\",IF(AD259>70,\"B+\",IF(AD259>60,\"B\",IF(AD259>50,\"C+\",IF(AD259>40,\"C\",IF(AD259>=33,\"D\",\"E\"))))))),\"--\")","v":"--"},null,null,null,null,null,{"$f":"Table_2[[#This Row],[Column51]]&Table_2[[#This Row],[Column52]]&AM261","v":""}]
[259,null,null,null,null,null,null,null,null,null,null,null,null,null,null,null,null,null,null,null,"--",0,null,null,{"$f":"(K260/Instructions!$C$23)*100","v":0},{"$f":"(L260/Instructions!$C$24)*100","v":0},{"$f":"(M260/Instructions!$C$25)*100","v":0},{"$f":"(N260/Instructions!$C$26)*100","v":0},{"$f":"(O260/Instructions!$C$27)*100","v":0},{"$f":"(U260/'Report Card'!$H$22)*100","v":{"$error":"#VALUE!"}},"----","E","E","E","E","E","--",null,null,null,null,null,{"$f":"Table_2[[#This Row],[Column51]]&Table_2[[#This Row],[Column52]]&AM262","v":""}]
[260,null,null,null,null,null,null,null,null,null,null,null,null,null,null,null,null,null,null,null,"--",0,null,null,{"$f":"(K261/Instructions!$C$23)*100","v":0},{"$f":"(L261/Instructions!$C$24)*100","v":0},{"$f":"(M261/Instructions!$C$25)*100","v":0},{"$f":"(N261/Instructions!$C$26)*100","v":0},{"$f":"(O261/Instructions!$C$27)*100","v":0},{"$f":"(U261/'Report Card'!$H$22)*100","v":{"$error":"#VALUE!"}},"----","E","E","E","E","E","--",null,null,null,null,null,{"$f":"Table_2[[#This Row],[Column51]]&Table_2[[#This Row],[Column52]]&AM263","v":""}]
[261,null,null,null,null,null,null,null,null,null,null,null,null,null,null,null,null,null,null,null,"--",0,null,null,{"$f":"(K262/Instructions!$C$23)*100","v":0},{"$f":"(L262/Instructions!$C$24)*100","v":0},{"$f":"(M262/Instructions!$C$25)*100","v":0},{"$f":"(N262/Instructions!$C$26)*100","v":0},{"$f":"(O262/Instructions!$C$27)*100","v":0},{"$f":"(U262/'Report Card'!$H$22)*100","v":{"$error":"#VALUE!"}},"----","E","E","E","E","E","--",null,null,null,null,null,{"$f":"Table_2[[#This Row],[Column51]]&Table_2[[#This Row],[Column52]]&AM264","v":""}]
[262,null,null,null,null,null,null,null,null,null,null,null,null,null,null,null,null,null,null,null,"--",0,null,null,{"$f":"(K263/Instructions!$C$23)*100","v":0},{"$f":"(L263/Instructions!$C$24)*100","v":0},{"$f":"(M263/Instructions!$C$25)*100","v":0},{"$f":"(N263/Instructions!$C$26)*100","v":0},{"$f":"(O263/Instructions!$C$27)*100","v":0},{"$f":"(U263/'Report Card'!$H$22)*100","v":{"$error":"#VALUE!"}},"----","E","E","E","E","E","--",null,null,null,null,null,{"$f":"Table_2[[#This Row],[Column51]]&Table_2[[#This Row],[Column52]]&AM265","v":""}]
[263,null,null,null,null,null,null,null,null,null,null,null,null,null,null,null,null,null,null,null,"--",0,null,null,{"$f":"(K264/Instructions!$C$23)*100","v":0},{"$f":"(L264/Instructions!$C$24)*100","v":0},{"$f":"(M264/Instructions!$C$25)*100","v":0},{"$f":"(N264/Instructions!$C$26)*100","v":0},{"$f":"(O264/Instructions!$C$27)*100","v":0},{"$f":"(U264/'Report Card'!$H$22)*100","v":{"$error":"#VALUE!"}},"----","E","E","E","E","E","--",null,null,null,null,null,{"$f":"Table_2[[#This Row],[Column51]]&Table_2[[#This Row],[Column52]]&AM266","v":""}]
[264,null,null,null,null,null,null,null,null,null,null,null,null,null,null,null,null,null,null,null,"--",0,null,null,{"$f":"(K265/Instructions!$C$23)*100","v":0},{"$f":"(L265/Instructions!$C$24)*100","v":0},{"$f":"(M265/Instructions!$C$25)*100","v":0},{"$f":"(N265/Instructions!$C$26)*100","v":0},{"$f":"(O265/Instructions!$C$27)*100","v":0},{"$f":"(U265/'Report Card'!$H$22)*100","v":{"$error":"#VALUE!"}},"----","E","E","E","E","E","--",null,null,null,null,null,{"$f":"Table_2[[#This Row],[Column51]]&Table_2[[#This Row],[Column52]]&AM267","v":""}]
[265,null,null,null,null,null,null,null,null,null,null,null,null,null,null,null,null,null,null,null,"--",0,null,null,{"$f":"(K266/Instructions!$C$23)*100","v":0},{"$f":"(L266/Instructions!$C$24)*100","v":0},{"$f":"(M266/Instructions!$C$25)*100","v":0},{"$f":"(N266/Instructions!$C$26)*100","v":0},{"$f":"(O266/Instructions!$C$27)*100","v":0},{"$f":"(U266/'Report Card'!$H$22)*100","v":{"$error":"#VALUE!"}},"----","E","E","E","E","E","--",null,null,null,null,null,{"$f":"Table_2[[#This Row],[Column51]]&Table_2[[#This Row],[Column52]]&AM268","v":""}]
[266,null,null,null,null,null,null,null,null,null,null,null,null,null,null,null,null,null,null,null,"--",0,null,null,{"$f":"(K267/Instructions!$C$23)*100","v":0},{"$f":"(L267/Instructions!$C$24)*100","v":0},{"$f":"(M267/Instructions!$C$25)*100","v":0},{"$f":"(N267/Instructions!$C$26)*100","v":0},{"$f":"(O267/Instructions!$C$27)*100","v":0},{"$f":"(U267/'Report Card'!$H$22)*100","v":{"$error":"#VALUE!"}},"----","E","E","E","E","E","--",null,null,null,null,null,{"$f":"Table_2[[#This Row],[Column51]]&Table_2[[#This Row],[Column52]]&AM269","v":""}]
[267,null,null,null,null,null,null,null,null,null,null,null,null,null,null,null,null,null,null,null,"--",0,null,null,{"$f":"(K268/Instructions!$C$23)*100","v":0},{"$f":"(L268/Instructions!$C$24)*100","v":0},{"$f":"(M268/Instructions!$C$25)*100","v":0},{"$f":"(N268/Instructions!$C$26)*100","v":0},{"$f":"(O268/Instructions!$C$27)*100","v":0},{"$f":"(U268/'Report Card'!$H$22)*100","v":{"$error":"#VALUE!"}},"----","E","E","E","E","E","--",null,null,null,null,null,{"$f":"Table_2[[#This Row],[Column51]]&Table_2[[#This Row],[Column52]]&AM270","v":""}]
[268,null,null,null,null,null,null,null,null,null,null,null,null,null,null,null,null,null,null,null,"--",0,null,null,{"$f":"(K269/Instructions!$C$23)*100","v":0},{"$f":"(L269/Instructions!$C$24)*100","v":0},{"$f":"(M269/Instructions!$C$25)*100","v":0},{"$f":"(N269/Instructions!$C$26)*100","v":0},{"$f":"(O269/Instructions!$C$27)*100","v":0},{"$f":"(U269/'Report Card'!$H$22)*100","v":{"$error":"#VALUE!"}},"----","E","E","E","E","E","--",null,null,null,null,null,{"$f":"Table_2[[#This Row],[Column51]]&Table_2[[#This Row],[Column52]]&AM271","v":""}]
[269,null,null,null,null,null,null,null,null,null,null,null,null,null,null,null,null,null,null,null,"--",0,null,null,{"$f":"(K270/Instructions!$C$23)*100","v":0},{"$f":"(L270/Instructions!$C$24)*100","v":0},{"$f":"(M270/Instructions!$C$25)*100","v":0},{"$f":"(N270/Instructions!$C$26)*100","v":0},{"$f":"(O270/Instructions!$C$27)*100","v":0},{"$f":"(U270/'Report Card'!$H$22)*100","v":{"$error":"#VALUE!"}},"----","E","E","E","E","E","--",null,null,null,null,null,{"$f":"Table_2[[#This Row],[Column51]]&Table_2[[#This Row],[Column52]]&AM272","v":""}]
[270,null,null,null,null,null,null,null,null,null,null,null,null,null,null,null,null,null,null,null,"--",0,null,null,{"$f":"(K271/Instructions!$C$23)*100","v":0},{"$f":"(L271/Instructions!$C$24)*100","v":0},{"$f":"(M271/Instructions!$C$25)*100","v":0},{"$f":"(N271/Instructions!$C$26)*100","v":0},{"$f":"(O271/Instructions!$C$27)*100","v":0},{"$f":"(U271/'Report Card'!$H$22)*100","v":{"$error":"#VALUE!"}},"----","E","E","E","E","E","--",null,null,null,null,null,{"$f":"Table_2[[#This Row],[Column51]]&Table_2[[#This Row],[Column52]]&AM273","v":""}]
[271,null,null,null,null,null,null,null,null,null,null,null,null,null,null,null,null,null,null,null,"--",0,null,null,{"$f":"(K272/Instructions!$C$23)*100","v":0},{"$f":"(L272/Instructions!$C$24)*100","v":0},{"$f":"(M272/Instructions!$C$25)*100","v":0},{"$f":"(N272/Instructions!$C$26)*100","v":0},{"$f":"(O272/Instructions!$C$27)*100","v":0},{"$f":"(U272/'Report Card'!$H$22)*100","v":{"$error":"#VALUE!"}},"----","E","E","E","E","E","--",null,null,null,null,null,{"$f":"Table_2[[#This Row],[Column51]]&Table_2[[#This Row],[Column52]]&AM274","v":""}]
[272,null,null,null,null,null,null,null,null,null,null,null,null,null,null,null,null,null,null,null,"--",0,null,null,{"$f":"(K273/Instructions!$C$23)*100","v":0},{"$f":"(L273/Instructions!$C$24)*100","v":0},{"$f":"(M273/Instructions!$C$25)*100","v":0},{"$f":"(N273/Instructions!$C$26)*100","v":0},{"$f":"(O273/Instructions!$C$27)*100","v":0},{"$f":"(U273/'Report Card'!$H$22)*100","v":{"$error":"#VALUE!"}},"----","E","E","E","E","E","--",null,null,null,null,null,{"$f":"Table_2[[#This Row],[Column51]]&Table_2[[#This Row],[Column52]]&AM275","v":""}]
[273,null,null,null,null,null,null,null,null,null,null,null,null,null,null,null,null,null,null,null,"--",0,null,null,{"$f":"(K274/Instructions!$C$23)*100","v":0},{"$f":"(L274/Instructions!$C$24)*100","v":0},{"$f":"(M274/Instructions!$C$25)*100","v":0},{"$f":"(N274/Instructions!$C$26)*100","v":0},{"$f":"(O274/Instructions!$C$27)*100","v":0},{"$f":"(U274/'Report Card'!$H$22)*100","v":{"$error":"#VALUE!"}},"----","E","E","E","E","E","--",null,null,null,null,null,{"$f":"Table_2[[#This Row],[Column51]]&Table_2[[#This Row],[Column52]]&AM276","v":""}]
[274,null,null,null,null,null,null,null,null,null,null,null,null,null,null,null,null,null,null,null,"--",0,null,null,{"$f":"(K275/Instructions!$C$23)*100","v":0},{"$f":"(L275/Instructions!$C$24)*100","v":0},{"$f":"(M275/Instructions!$C$25)*100","v":0},{"$f":"(N275/Instructions!$C$26)*100","v":0},{"$f":"(O275/Instructions!$C$27)*100","v":0},{"$f":"(U275/'Report Card'!$H$22)*100","v":{"$error":"#VALUE!"}},"----","E","E","E","E","E","--",null,null,null,null,null,{"$f":"Table_2[[#This Row],[Column51]]&Table_2[[#This Row],[Column52]]&AM277","v":""}]
[275,null,null,null,null,null,null,null,null,null,null,null,null,null,null,null,null,null,null,null,"--",0,null,null,{"$f":"(K276/Instructions!$C$23)*100","v":0},{"$f":"(L276/Instructions!$C$24)*100","v":0},{"$f":"(M276/Instructions!$C$25)*100","v":0},{"$f":"(N276/Instructions!$C$26)*100","v":0},{"$f":"(O276/Instructions!$C$27)*100","v":0},{"$f":"(U276/'Report Card'!$H$22)*100","v":{"$error":"#VALUE!"}},"----","E","E","E","E","E","--",null,null,null,null,null,{"$f":"Table_2[[#This Row],[Column51]]&Table_2[[#This Row],[Column52]]&AM278","v":""}]
[276,null,null,null,null,null,null,null,null,null,null,null,null,null,null,null,null,null,null,null,"--",0,null,null,{"$f":"(K277/Instructions!$C$23)*100","v":0},{"$f":"(L277/Instructions!$C$24)*100","v":0},{"$f":"(M277/Instructions!$C$25)*100","v":0},{"$f":"(N277/Instructions!$C$26)*100","v":0},{"$f":"(O277/Instructions!$C$27)*100","v":0},{"$f":"(U277/'Report Card'!$H$22)*100","v":{"$error":"#VALUE!"}},"----","E","E","E","E","E","--",null,null,null,null,null,{"$f":"Table_2[[#This Row],[Column51]]&Table_2[[#This Row],[Column52]]&AM279","v":""}]
[277,null,null,null,null,null,null,null,null,null,null,null,null,null,null,null,null,null,null,null,"--",0,null,null,{"$f":"(K278/Instructions!$C$23)*100","v":0},{"$f":"(L278/Instructions!$C$24)*100","v":0},{"$f":"(M278/Instructions!$C$25)*100","v":0},{"$f":"(N278/Instructions!$C$26)*100","v":0},{"$f":"(O278/Instructions!$C$27)*100","v":0},{"$f":"(U278/'Report Card'!$H$22)*100","v":{"$error":"#VALUE!"}},"----","E","E","E","E","E","--",null,null,null,null,null,{"$f":"Table_2[[#This Row],[Column51]]&Table_2[[#This Row],[Column52]]&AM280","v":""}]
[278,null,null,null,null,null,null,null,null,null,null,null,null,null,null,null,null,null,null,null,"--",0,null,null,{"$f":"(K279/Instructions!$C$23)*100","v":0},{"$f":"(L279/Instructions!$C$24)*100","v":0},{"$f":"(M279/Instructions!$C$25)*100","v":0},{"$f":"(N279/Instructions!$C$26)*100","v":0},{"$f":"(O279/Instructions!$C$27)*100","v":0},{"$f":"(U279/'Report Card'!$H$22)*100","v":{"$error":"#VALUE!"}},"----","E","E","E","E","E","--",null,null,null,null,null,{"$f":"Table_2[[#This Row],[Column51]]&Table_2[[#This Row],[Column52]]&AM281","v":""}]
[279,null,null,null,null,null,null,null,null,null,null,null,null,null,null,null,null,null,null,null,"--",0,null,null,{"$f":"(K280/Instructions!$C$23)*100","v":0},{"$f":"(L280/Instructions!$C$24)*100","v":0},{"$f":"(M280/Instructions!$C$25)*100","v":0},{"$f":"(N280/Instructions!$C$26)*100","v":0},{"$f":"(O280/Instructions!$C$27)*100","v":0},{"$f":"(U280/'Report Card'!$H$22)*100","v":{"$error":"#VALUE!"}},"----","E","E","E","E","E","--",null,null,null,null,null,{"$f":"Table_2[[#This Row],[Column51]]&Table_2[[#This Row],[Column52]]&AM282","v":""}]
[280,null,null,null,null,null,null,null,null,null,null,null,null,null,null,null,null,null,null,null,"--",0,null,null,{"$f":"(K281/Instructions!$C$23)*100","v":0},{"$f":"(L281/Instructions!$C$24)*100","v":0},{"$f":"(M281/Instructions!$C$25)*100","v":0},{"$f":"(N281/Instructions!$C$26)*100","v":0},{"$f":"(O281/Instructions!$C$27)*100","v":0},{"$f":"(U281/'Report Card'!$H$22)*100","v":{"$error":"#VALUE!"}},"----","E","E","E","E","E","--",null,null,null,null,null,{"$f":"Table_2[[#This Row],[Column51]]&Table_2[[#This Row],[Column52]]&AM283","v":""}]
[281,null,null,null,null,null,null,null,null,null,null,null,null,null,null,null,null,null,null,null,"--",0,null,null,{"$f":"(K282/Instructions!$C$23)*100","v":0},{"$f":"(L282/Instructions!$C$24)*100","v":0},{"$f":"(M282/Instructions!$C$25)*100","v":0},{"$f":"(N282/Instructions!$C$26)*100","v":0},{"$f":"(O282/Instructions!$C$27)*100","v":0},{"$f":"(U282/'Report Card'!$H$22)*100","v":{"$error":"#VALUE!"}},"----","E","E","E","E","E","--",null,null,null,null,null,{"$f":"Table_2[[#This Row],[Column51]]&Table_2[[#This Row],[Column52]]&AM284","v":""}]
[282,null,null,null,null,null,null,null,null,null,null,null,null,null,null,null,null,null,null,null,"--",0,null,null,{"$f":"(K283/Instructions!$C$23)*100","v":0},{"$f":"(L283/Instructions!$C$24)*100","v":0},{"$f":"(M283/Instructions!$C$25)*100","v":0},{"$f":"(N283/Instructions!$C$26)*100","v":0},{"$f":"(O283/Instructions!$C$27)*100","v":0},{"$f":"(U283/'Report Card'!$H$22)*100","v":{"$error":"#VALUE!"}},"----","E","E","E","E","E","--",null,null,null,null,null,{"$f":"Table_2[[#This Row],[Column51]]&Table_2[[#This Row],[Column52]]&AM285","v":""}]
[283,null,null,null,null,null,null,null,null,null,null,null,null,null,null,null,null,null,null,null,"--",0,null,null,{"$f":"(K284/Instructions!$C$23)*100","v":0},{"$f":"(L284/Instructions!$C$24)*100","v":0},{"$f":"(M284/Instructions!$C$25)*100","v":0},{"$f":"(N284/Instructions!$C$26)*100","v":0},{"$f":"(O284/Instructions!$C$27)*100","v":0},{"$f":"(U284/'Report Card'!$H$22)*100","v":{"$error":"#VALUE!"}},"----","E","E","E","E","E","--",null,null,null,null,null,{"$f":"Table_2[[#This Row],[Column51]]&Table_2[[#This Row],[Column52]]&AM286","v":""}]
[284,null,null,null,null,null,null,null,null,null,null,null,null,null,null,null,null,null,null,null,"--",0,null,null,{"$f":"(K285/Instructions!$C$23)*100","v":0},{"$f":"(L285/Instructions!$C$24)*100","v":0},{"$f":"(M285/Instructions!$C$25)*100","v":0},{"$f":"(N285/Instructions!$C$26)*100","v":0},{"$f":"(O285/Instructions!$C$27)*100","v":0},{"$f":"(U285/'Report Card'!$H$22)*100","v":{"$error":"#VALUE!"}},"----","E","E","E","E","E","--",null,null,null,null,null,{"$f":"Table_2[[#This Row],[Column51]]&Table_2[[#This Row],[Column52]]&AM287","v":""}]
[285,null,null,null,null,null,null,null,null,null,null,null,null,null,null,null,null,null,null,null,"--",0,null,null,{"$f":"(K286/Instructions!$C$23)*100","v":0},{"$f":"(L286/Instructions!$C$24)*100","v":0},{"$f":"(M286/Instructions!$C$25)*100","v":0},{"$f":"(N286/Instructions!$C$26)*100","v":0},{"$f":"(O286/Instructions!$C$27)*100","v":0},{"$f":"(U286/'Report Card'!$H$22)*100","v":{"$error":"#VALUE!"}},"----","E","E","E","E","E","--",null,null,null,null,null,{"$f":"Table_2[[#This Row],[Column51]]&Table_2[[#This Row],[Column52]]&AM288","v":""}]
[286,null,null,null,null,null,null,null,null,null,null,null,null,null,null,null,null,null,null,null,"--",0,null,null,{"$f":"(K287/Instructions!$C$23)*100","v":0},{"$f":"(L287/Instructions!$C$24)*100","v":0},{"$f":"(M287/Instructions!$C$25)*100","v":0},{"$f":"(N287/Instructions!$C$26)*100","v":0},{"$f":"(O287/Instructions!$C$27)*100","v":0},{"$f":"(U287/'Report Card'!$H$22)*100","v":{"$error":"#VALUE!"}},"----","E","E","E","E","E","--",null,null,null,null,null,{"$f":"Table_2[[#This Row],[Column51]]&Table_2[[#This Row],[Column52]]&AM289","v":""}]
[287,null,null,null,null,null,null,null,null,null,null,null,null,null,null,null,null,null,null,null,"--",0,null,null,{"$f":"(K288/Instructions!$C$23)*100","v":0},{"$f":"(L288/Instructions!$C$24)*100","v":0},{"$f":"(M288/Instructions!$C$25)*100","v":0},{"$f":"(N288/Instructions!$C$26)*100","v":0},{"$f":"(O288/Instructions!$C$27)*100","v":0},{"$f":"(U288/'Report Card'!$H$22)*100","v":{"$error":"#VALUE!"}},"----","E","E","E","E","E","--",null,null,null,null,null,{"$f":"Table_2[[#This Row],[Column51]]&Table_2[[#This Row],[Column52]]&AM290","v":""}]
[288,null,null,null,null,null,null,null,null,null,null,null,null,null,null,null,null,null,null,null,"--",0,null,null,{"$f":"(K289/Instructions!$C$23)*100","v":0},{"$f":"(L289/Instructions!$C$24)*100","v":0},{"$f":"(M289/Instructions!$C$25)*100","v":0},{"$f":"(N289/Instructions!$C$26)*100","v":0},{"$f":"(O289/Instructions!$C$27)*100","v":0},{"$f":"(U289/'Report Card'!$H$22)*100","v":{"$error":"#VALUE!"}},"----","E","E","E","E","E","--",null,null,null,null,null,{"$f":"Table_2[[#This Row],[Column51]]&Table_2[[#This Row],[Column52]]&AM291","v":""}]
[289,null,null,null,null,null,null,null,null,null,null,null,null,null,null,null,null,null,null,null,"--",0,null,null,{"$f":"(K290/Instructions!$C$23)*100","v":0},{"$f":"(L290/Instructions!$C$24)*100","v":0},{"$f":"(M290/Instructions!$C$25)*100","v":0},{"$f":"(N290/Instructions!$C$26)*100","v":0},{"$f":"(O290/Instructions!$C$27)*100","v":0},{"$f":"(U290/'Report Card'!$H$22)*100","v":{"$error":"#VALUE!"}},"----","E","E","E","E","E","--",null,null,null,null,null,{"$f":"Table_2[[#This Row],[Column51]]&Table_2[[#This Row],[Column52]]&AM292","v":""}]
[290,null,null,null,null,null,null,null,null,null,null,null,null,null,null,null,null,null,null,null,"--",0,null,null,{"$f":"(K291/Instructions!$C$23)*100","v":0},{"$f":"(L291/Instructions!$C$24)*100","v":0},{"$f":"(M291/Instructions!$C$25)*100","v":0},{"$f":"(N291/Instructions!$C$26)*100","v":0},{"$f":"(O291/Instructions!$C$27)*100","v":0},{"$f":"(U291/'Report Card'!$H$22)*100","v":{"$error":"#VALUE!"}},"----","E","E","E","E","E","--",null,null,null,null,null,{"$f":"Table_2[[#This Row],[Column51]]&Table_2[[#This Row],[Column52]]&AM293","v":""}]
[291,null,null,null,null,null,null,null,null,null,null,null,null,null,null,null,null,null,null,null,"--",0,null,null,{"$f":"(K292/Instructions!$C$23)*100","v":0},{"$f":"(L292/Instructions!$C$24)*100","v":0},{"$f":"(M292/Instructions!$C$25)*100","v":0},{"$f":"(N292/Instructions!$C$26)*100","v":0},{"$f":"(O292/Instructions!$C$27)*100","v":0},{"$f":"(U292/'Report Card'!$H$22)*100","v":{"$error":"#VALUE!"}},"----","E","E","E","E","E","--",null,null,null,null,null,{"$f":"Table_2[[#This Row],[Column51]]&Table_2[[#This Row],[Column52]]&AM294","v":""}]
[292,null,null,null,null,null,null,null,null,null,null,null,null,null,null,null,null,null,null,null,"--",0,null,null,{"$f":"(K293/Instructions!$C$23)*100","v":0},{"$f":"(L293/Instructions!$C$24)*100","v":0},{"$f":"(M293/Instructions!$C$25)*100","v":0},{"$f":"(N293/Instructions!$C$26)*100","v":0},{"$f":"(O293/Instructions!$C$27)*100","v":0},{"$f":"(U293/'Report Card'!$H$22)*100","v":{"$error":"#VALUE!"}},"----","E","E","E","E","E","--",null,null,null,null,null,{"$f":"Table_2[[#This Row],[Column51]]&Table_2[[#This Row],[Column52]]&AM295","v":""}]
[293,null,null,null,null,null,null,null,null,null,null,null,null,null,null,null,null,null,null,null,"--",0,null,null,{"$f":"(K294/Instructions!$C$23)*100","v":0},{"$f":"(L294/Instructions!$C$24)*100","v":0},{"$f":"(M294/Instructions!$C$25)*100","v":0},{"$f":"(N294/Instructions!$C$26)*100","v":0},{"$f":"(O294/Instructions!$C$27)*100","v":0},{"$f":"(U294/'Report Card'!$H$22)*100","v":{"$error":"#VALUE!"}},"----","E","E","E","E","E","--",null,null,null,null,null,{"$f":"Table_2[[#This Row],[Column51]]&Table_2[[#This Row],[Column52]]&AM296","v":""}]
[294,null,null,null,null,null,null,null,null,null,null,null,null,null,null,null,null,null,null,null,"--",0,null,null,{"$f":"(K295/Instructions!$C$23)*100","v":0},{"$f":"(L295/Instructions!$C$24)*100","v":0},{"$f":"(M295/Instructions!$C$25)*100","v":0},{"$f":"(N295/Instructions!$C$26)*100","v":0},{"$f":"(O295/Instructions!$C$27)*100","v":0},{"$f":"(U295/'Report Card'!$H$22)*100","v":{"$error":"#VALUE!"}},"----","E","E","E","E","E","--",null,null,null,null,null,{"$f":"Table_2[[#This Row],[Column51]]&Table_2[[#This Row],[Column52]]&AM297","v":""}]
[295,null,null,null,null,null,null,null,null,null,null,null,null,null,null,null,null,null,null,null,"--",0,null,null,{"$f":"(K296/Instructions!$C$23)*100","v":0},{"$f":"(L296/Instructions!$C$24)*100","v":0},{"$f":"(M296/Instructions!$C$25)*100","v":0},{"$f":"(N296/Instructions!$C$26)*100","v":0},{"$f":"(O296/Instructions!$C$27)*100","v":0},{"$f":"(U296/'Report Card'!$H$22)*100","v":{"$error":"#VALUE!"}},"----","E","E","E","E","E","--",null,null,null,null,null,{"$f":"Table_2[[#This Row],[Column51]]&Table_2[[#This Row],[Column52]]&AM298","v":""}]
[296,null,null,null,null,null,null,null,null,null,null,null,null,null,null,null,null,null,null,null,"--",0,null,null,{"$f":"(K297/Instructions!$C$23)*100","v":0},{"$f":"(L297/Instructions!$C$24)*100","v":0},{"$f":"(M297/Instructions!$C$25)*100","v":0},{"$f":"(N297/Instructions!$C$26)*100","v":0},{"$f":"(O297/Instructions!$C$27)*100","v":0},{"$f":"(U297/'Report Card'!$H$22)*100","v":{"$error":"#VALUE!"}},"----","E","E","E","E","E","--",null,null,null,null,null,{"$f":"Table_2[[#This Row],[Column51]]&Table_2[[#This Row],[Column52]]&AM299","v":""}]
[297,null,null,null,null,null,null,null,null,null,null,null,null,null,null,null,null,null,null,null,"--",0,null,null,{"$f":"(K298/Instructions!$C$23)*100","v":0},{"$f":"(L298/Instructions!$C$24)*100","v":0},{"$f":"(M298/Instructions!$C$25)*100","v":0},{"$f":"(N298/Instructions!$C$26)*100","v":0},{"$f":"(O298/Instructions!$C$27)*100","v":0},{"$f":"(U298/'Report Card'!$H$22)*100","v":{"$error":"#VALUE!"}},"----","E","E","E","E","E","--",null,null,null,null,null,{"$f":"Table_2[[#This Row],[Column51]]&Table_2[[#This Row],[Column52]]&AM300","v":""}]
[298,null,null,null,null,null,null,null,null,null,null,null,null,null,null,null,null,null,null,null,"--",0,null,null,{"$f":"(K299/Instructions!$C$23)*100","v":0},{"$f":"(L299/Instructions!$C$24)*100","v":0},{"$f":"(M299/Instructions!$C$25)*100","v":0},{"$f":"(N299/Instructions!$C$26)*100","v":0},{"$f":"(O299/Instructions!$C$27)*100","v":0},{"$f":"(U299/'Report Card'!$H$22)*100","v":{"$error":"#VALUE!"}},"----","E","E","E","E","E","--",null,null,null,null,null,{"$f":"Table_2[[#This Row],[Column51]]&Table_2[[#This Row],[Column52]]&AM301","v":""}]
[299,null,null,null,null,null,null,null,null,null,null,null,null,null,null,null,null,null,null,null,"--",0,null,null,{"$f":"(K300/Instructions!$C$23)*100","v":0},{"$f":"(L300/Instructions!$C$24)*100","v":0},{"$f":"(M300/Instructions!$C$25)*100","v":0},{"$f":"(N300/Instructions!$C$26)*100","v":0},{"$f":"(O300/Instructions!$C$27)*100","v":0},{"$f":"(U300/'Report Card'!$H$22)*100","v":{"$error":"#VALUE!"}},"----","E","E","E","E","E","--",null,null,null,null,null,{"$f":"Table_2[[#This Row],[Column51]]&Table_2[[#This Row],[Column52]]&AM302","v":""}]
[300,null,null,null,null,null,null,null,null,null,null,null,null,null,null,null,null,null,null,null,"--",0,null,null,{"$f":"(K301/Instructions!$C$23)*100","v":0},{"$f":"(L301/Instructions!$C$24)*100","v":0},{"$f":"(M301/Instructions!$C$25)*100","v":0},{"$f":"(N301/Instructions!$C$26)*100","v":0},{"$f":"(O301/Instructions!$C$27)*100","v":0},{"$f":"(U301/'Report Card'!$H$22)*100","v":{"$error":"#VALUE!"}},"----","E","E","E","E","E","--",null,null,null,null,null,{"$f":"Table_2[[#This Row],[Column51]]&Table_2[[#This Row],[Column52]]&AM303","v":""}]
[301,null,null,null,null,null,null,null,null,null,null,null,null,null,null,null,null,null,null,null,"--",0,null,null,{"$f":"(K302/Instructions!$C$23)*100","v":0},{"$f":"(L302/Instructions!$C$24)*100","v":0},{"$f":"(M302/Instructions!$C$25)*100","v":0},{"$f":"(N302/Instructions!$C$26)*100","v":0},{"$f":"(O302/Instructions!$C$27)*100","v":0},{"$f":"(U302/'Report Card'!$H$22)*100","v":{"$error":"#VALUE!"}},"----","E","E","E","E","E","--",null,null,null,null,null,{"$f":"Table_2[[#This Row],[Column51]]&Table_2[[#This Row],[Column52]]&AM304","v":""}]
[302,null,null,null,null,null,null,null,null,null,null,null,null,null,null,null,null,null,null,null,"--",0,null,null,{"$f":"(K303/Instructions!$C$23)*100","v":0},{"$f":"(L303/Instructions!$C$24)*100","v":0},{"$f":"(M303/Instructions!$C$25)*100","v":0},{"$f":"(N303/Instructions!$C$26)*100","v":0},{"$f":"(O303/Instructions!$C$27)*100","v":0},{"$f":"(U303/'Report Card'!$H$22)*100","v":{"$error":"#VALUE!"}},"----","E","E","E","E","E","--",null,null,null,null,null,{"$f":"Table_2[[#This Row],[Column51]]&Table_2[[#This Row],[Column52]]&AM305","v":""}]
[303,null,null,null,null,null,null,null,null,null,null,null,null,null,null,null,null,null,null,null,"--",0,null,null,{"$f":"(K304/Instructions!$C$23)*100","v":0},{"$f":"(L304/Instructions!$C$24)*100","v":0},{"$f":"(M304/Instructions!$C$25)*100","v":0},{"$f":"(N304/Instructions!$C$26)*100","v":0},{"$f":"(O304/Instructions!$C$27)*100","v":0},{"$f":"(U304/'Report Card'!$H$22)*100","v":{"$error":"#VALUE!"}},"----","E","E","E","E","E","--",null,null,null,null,null,{"$f":"Table_2[[#This Row],[Column51]]&Table_2[[#This Row],[Column52]]&AM306","v":""}]
[304,null,null,null,null,null,null,null,null,null,null,null,null,null,null,null,null,null,null,null,"--",0,null,null,{"$f":"(K305/Instructions!$C$23)*100","v":0},{"$f":"(L305/Instructions!$C$24)*100","v":0},{"$f":"(M305/Instructions!$C$25)*100","v":0},{"$f":"(N305/Instructions!$C$26)*100","v":0},{"$f":"(O305/Instructions!$C$27)*100","v":0},{"$f":"(U305/'Report Card'!$H$22)*100","v":{"$error":"#VALUE!"}},"----","E","E","E","E","E","--",null,null,null,null,null,{"$f":"Table_2[[#This Row],[Column51]]&Table_2[[#This Row],[Column52]]&AM307","v":""}]
[305,null,null,null,null,null,null,null,null,null,null,null,null,null,null,null,null,null,null,null,"--",0,null,null,{"$f":"(K306/Instructions!$C$23)*100","v":0},{"$f":"(L306/Instructions!$C$24)*100","v":0},{"$f":"(M306/Instructions!$C$25)*100","v":0},{"$f":"(N306/Instructions!$C$26)*100","v":0},{"$f":"(O306/Instructions!$C$27)*100","v":0},{"$f":"(U306/'Report Card'!$H$22)*100","v":{"$error":"#VALUE!"}},"----","E","E","E","E","E","--",null,null,null,null,null,{"$f":"Table_2[[#This Row],[Column51]]&Table_2[[#This Row],[Column52]]&AM308","v":""}]
[306,null,null,null,null,null,null,null,null,null,null,null,null,null,null,null,null,null,null,null,"--",0,null,null,{"$f":"(K307/Instructions!$C$23)*100","v":0},{"$f":"(L307/Instructions!$C$24)*100","v":0},{"$f":"(M307/Instructions!$C$25)*100","v":0},{"$f":"(N307/Instructions!$C$26)*100","v":0},{"$f":"(O307/Instructions!$C$27)*100","v":0},{"$f":"(U307/'Report Card'!$H$22)*100","v":{"$error":"#VALUE!"}},"----","E","E","E","E","E","--",null,null,null,null,null,{"$f":"Table_2[[#This Row],[Column51]]&Table_2[[#This Row],[Column52]]&AM309","v":""}]
[307,null,null,null,null,null,null,null,null,null,null,null,null,null,null,null,null,null,null,null,"--",0,null,null,{"$f":"(K308/Instructions!$C$23)*100","v":0},{"$f":"(L308/Instructions!$C$24)*100","v":0},{"$f":"(M308/Instructions!$C$25)*100","v":0},{"$f":"(N308/Instructions!$C$26)*100","v":0},{"$f":"(O308/Instructions!$C$27)*100","v":0},{"$f":"(U308/'Report Card'!$H$22)*100","v":{"$error":"#VALUE!"}},"----","E","E","E","E","E","--",null,null,null,null,null,{"$f":"Table_2[[#This Row],[Column51]]&Table_2[[#This Row],[Column52]]&AM310","v":""}]
[308,null,null,null,null,null,null,null,null,null,null,null,null,null,null,null,null,null,null,null,"--",0,null,null,{"$f":"(K309/Instructions!$C$23)*100","v":0},{"$f":"(L309/Instructions!$C$24)*100","v":0},{"$f":"(M309/Instructions!$C$25)*100","v":0},{"$f":"(N309/Instructions!$C$26)*100","v":0},{"$f":"(O309/Instructions!$C$27)*100","v":0},{"$f":"(U309/'Report Card'!$H$22)*100","v":{"$error":"#VALUE!"}},"----","E","E","E","E","E","--",null,null,null,null,null,{"$f":"Table_2[[#This Row],[Column51]]&Table_2[[#This Row],[Column52]]&AM311","v":""}]
[309,null,null,null,null,null,null,null,null,null,null,null,null,null,null,null,null,null,null,null,"--",0,null,null,{"$f":"(K310/Instructions!$C$23)*100","v":0},{"$f":"(L310/Instructions!$C$24)*100","v":0},{"$f":"(M310/Instructions!$C$25)*100","v":0},{"$f":"(N310/Instructions!$C$26)*100","v":0},{"$f":"(O310/Instructions!$C$27)*100","v":0},{"$f":"(U310/'Report Card'!$H$22)*100","v":{"$error":"#VALUE!"}},"----","E","E","E","E","E","--",null,null,null,null,null,{"$f":"Table_2[[#This Row],[Column51]]&Table_2[[#This Row],[Column52]]&AM312","v":""}]
[310,null,null,null,null,null,null,null,null,null,null,null,null,null,null,null,null,null,null,null,"--",0,null,null,{"$f":"(K311/Instructions!$C$23)*100","v":0},{"$f":"(L311/Instructions!$C$24)*100","v":0},{"$f":"(M311/Instructions!$C$25)*100","v":0},{"$f":"(N311/Instructions!$C$26)*100","v":0},{"$f":"(O311/Instructions!$C$27)*100","v":0},{"$f":"(U311/'Report Card'!$H$22)*100","v":{"$error":"#VALUE!"}},"----","E","E","E","E","E","--",null,null,null,null,null,{"$f":"Table_2[[#This Row],[Column51]]&Table_2[[#This Row],[Column52]]&AM313","v":""}]
[311,null,null,null,null,null,null,null,null,null,null,null,null,null,null,null,null,null,null,null,"--",0,null,null,{"$f":"(K312/Instructions!$C$23)*100","v":0},{"$f":"(L312/Instructions!$C$24)*100","v":0},{"$f":"(M312/Instructions!$C$25)*100","v":0},{"$f":"(N312/Instructions!$C$26)*100","v":0},{"$f":"(O312/Instructions!$C$27)*100","v":0},{"$f":"(U312/'Report Card'!$H$22)*100","v":{"$error":"#VALUE!"}},"----","E","E","E","E","E","--",null,null,null,null,null,{"$f":"Table_2[[#This Row],[Column51]]&Table_2[[#This Row],[Column52]]&AM314","v":""}]
[312,null,null,null,null,null,null,null,null,null,null,null,null,null,null,null,null,null,null,null,"--",0,null,null,{"$f":"(K313/Instructions!$C$23)*100","v":0},{"$f":"(L313/Instructions!$C$24)*100","v":0},{"$f":"(M313/Instructions!$C$25)*100","v":0},{"$f":"(N313/Instructions!$C$26)*100","v":0},{"$f":"(O313/Instructions!$C$27)*100","v":0},{"$f":"(U313/'Report Card'!$H$22)*100","v":{"$error":"#VALUE!"}},"----","E","E","E","E","E","--",null,null,null,null,null,{"$f":"Table_2[[#This Row],[Column51]]&Table_2[[#This Row],[Column52]]&AM315","v":""}]
[313,null,null,null,null,null,null,null,null,null,null,null,null,null,null,null,null,null,null,null,"--",0,null,null,{"$f":"(K314/Instructions!$C$23)*100","v":0},{"$f":"(L314/Instructions!$C$24)*100","v":0},{"$f":"(M314/Instructions!$C$25)*100","v":0},{"$f":"(N314/Instructions!$C$26)*100","v":0},{"$f":"(O314/Instructions!$C$27)*100","v":0},{"$f":"(U314/'Report Card'!$H$22)*100","v":{"$error":"#VALUE!"}},"----","E","E","E","E","E","--",null,null,null,null,null,{"$f":"Table_2[[#This Row],[Column51]]&Table_2[[#This Row],[Column52]]&AM316","v":""}]
[314,null,null,null,null,null,null,null,null,null,null,null,null,null,null,null,null,null,null,null,"--",0,null,null,{"$f":"(K315/Instructions!$C$23)*100","v":0},{"$f":"(L315/Instructions!$C$24)*100","v":0},{"$f":"(M315/Instructions!$C$25)*100","v":0},{"$f":"(N315/Instructions!$C$26)*100","v":0},{"$f":"(O315/Instructions!$C$27)*100","v":0},{"$f":"(U315/'Report Card'!$H$22)*100","v":{"$error":"#VALUE!"}},"----","E","E","E","E","E","--",null,null,null,null,null,{"$f":"Table_2[[#This Row],[Column51]]&Table_2[[#This Row],[Column52]]&AM317","v":""}]
[315,null,null,null,null,null,null,null,null,null,null,null,null,null,null,null,null,null,null,null,"--",0,null,null,{"$f":"(K316/Instructions!$C$23)*100","v":0},{"$f":"(L316/Instructions!$C$24)*100","v":0},{"$f":"(M316/Instructions!$C$25)*100","v":0},{"$f":"(N316/Instructions!$C$26)*100","v":0},{"$f":"(O316/Instructions!$C$27)*100","v":0},{"$f":"(U316/'Report Card'!$H$22)*100","v":{"$error":"#VALUE!"}},"----","E","E","E","E","E","--",null,null,null,null,null,{"$f":"Table_2[[#This Row],[Column51]]&Table_2[[#This Row],[Column52]]&AM318","v":""}]
[316,null,null,null,null,null,null,null,null,null,null,null,null,null,null,null,null,null,null,null,"--",0,null,null,{"$f":"(K317/Instructions!$C$23)*100","v":0},{"$f":"(L317/Instructions!$C$24)*100","v":0},{"$f":"(M317/Instructions!$C$25)*100","v":0},{"$f":"(N317/Instructions!$C$26)*100","v":0},{"$f":"(O317/Instructions!$C$27)*100","v":0},{"$f":"(U317/'Report Card'!$H$22)*100","v":{"$error":"#VALUE!"}},"----","E","E","E","E","E","--",null,null,null,null,null,{"$f":"Table_2[[#This Row],[Column51]]&Table_2[[#This Row],[Column52]]&AM319","v":""}]
[317,null,null,null,null,null,null,null,null,null,null,null,null,null,null,null,null,null,null,null,"--",0,null,null,{"$f":"(K318/Instructions!$C$23)*100","v":0},{"$f":"(L318/Instructions!$C$24)*100","v":0},{"$f":"(M318/Instructions!$C$25)*100","v":0},{"$f":"(N318/Instructions!$C$26)*100","v":0},{"$f":"(O318/Instructions!$C$27)*100","v":0},{"$f":"(U318/'Report Card'!$H$22)*100","v":{"$error":"#VALUE!"}},"----","E","E","E","E","E","--",null,null,null,null,null,{"$f":"Table_2[[#This Row],[Column51]]&Table_2[[#This Row],[Column52]]&AM320","v":""}]
[318,null,null,null,null,null,null,null,null,null,null,null,null,null,null,null,null,null,null,null,"--",0,null,null,{"$f":"(K319/Instructions!$C$23)*100","v":0},{"$f":"(L319/Instructions!$C$24)*100","v":0},{"$f":"(M319/Instructions!$C$25)*100","v":0},{"$f":"(N319/Instructions!$C$26)*100","v":0},{"$f":"(O319/Instructions!$C$27)*100","v":0},{"$f":"(U319/'Report Card'!$H$22)*100","v":{"$error":"#VALUE!"}},"----","E","E","E","E","E","--",null,null,null,null,null,{"$f":"Table_2[[#This Row],[Column51]]&Table_2[[#This Row],[Column52]]&AM321","v":""}]
[319,null,null,null,null,null,null,null,null,null,null,null,null,null,null,null,null,null,null,null,"--",0,null,null,{"$f":"(K320/Instructions!$C$23)*100","v":0},{"$f":"(L320/Instructions!$C$24)*100","v":0},{"$f":"(M320/Instructions!$C$25)*100","v":0},{"$f":"(N320/Instructions!$C$26)*100","v":0},{"$f":"(O320/Instructions!$C$27)*100","v":0},{"$f":"(U320/'Report Card'!$H$22)*100","v":{"$error":"#VALUE!"}},"----","E","E","E","E","E","--",null,null,null,null,null,{"$f":"Table_2[[#This Row],[Column51]]&Table_2[[#This Row],[Column52]]&AM322","v":""}]
[320,null,null,null,null,null,null,null,null,null,null,null,null,null,null,null,null,null,null,null,"--",0,null,null,{"$f":"(K321/Instructions!$C$23)*100","v":0},{"$f":"(L321/Instructions!$C$24)*100","v":0},{"$f":"(M321/Instructions!$C$25)*100","v":0},{"$f":"(N321/Instructions!$C$26)*100","v":0},{"$f":"(O321/Instructions!$C$27)*100","v":0},{"$f":"(U321/'Report Card'!$H$22)*100","v":{"$error":"#VALUE!"}},"----","E","E","E","E","E","--",null,null,null,null,null,{"$f":"Table_2[[#This Row],[Column51]]&Table_2[[#This Row],[Column52]]&AM323","v":""}]
[321,null,null,null,null,null,null,null,null,null,null,null,null,null,null,null,null,null,null,null,{"$f":"IF(MIN(Y322:AC322)>=33,SUM(K322:P322),\"--\")","v":"--"},0,null,null,{"$f":"(K322/Instructions!$C$23)*100","v":0},{"$f":"(L322/Instructions!$C$24)*100","v":0},{"$f":"(M322/Instructions!$C$25)*100","v":0},{"$f":"(N322/Instructions!$C$26)*100","v":0},{"$f":"(O322/Instructions!$C$27)*100","v":0},{"$f":"(U322/'Report Card'!$H$22)*100","v":{"$error":"#VALUE!"}},"----",{"$f":"IFERROR(IF(Y322>90,\"A+\",IF(Y322>80,\"A\",IF(Y322>70,\"B+\",IF(Y322>60,\"B\",IF(Y322>50,\"C+\",IF(Y322>40,\"C\",IF(Y322>=33,\"D\",\"E\"))))))),\"Abs\")","v":"E"},{"$f":"IFERROR(IF(Z322>90,\"A+\",IF(Z322>80,\"A\",IF(Z322>70,\"B+\",IF(Z322>60,\"B\",IF(Z322>50,\"C+\",IF(Z322>40,\"C\",IF(Z322>=33,\"D\",\"E\"))))))),\"Abs\")","v":"E"},{"$f":"IFERROR(IF(AA322>90,\"A+\",IF(AA322>80,\"A\",IF(AA322>70,\"B+\",IF(AA322>60,\"B\",IF(AA322>50,\"C+\",IF(AA322>40,\"C\",IF(AA322>=33,\"D\",\"E\"))))))),\"Abs\")","v":"E"},{"$f":"IFERROR(IF(AB322>90,\"A+\",IF(AB322>80,\"A\",IF(AB322>70,\"B+\",IF(AB322>60,\"B\",IF(AB322>50,\"C+\",IF(AB322>40,\"C\",IF(AB322>=33,\"D\",\"E\"))))))),\"Abs\")","v":"E"},{"$f":"IFERROR(IF(AC322>90,\"A+\",IF(AC322>80,\"A\",IF(AC322>70,\"B+\",IF(AC322>60,\"B\",IF(AC322>50,\"C+\",IF(AC322>40,\"C\",IF(AC322>=33,\"D\",\"E\"))))))),\"Abs\")","v":"E"},"--",null,null,null,null,null,{"$f":"Table_2[[#This Row],[Column51]]&Table_2[[#This Row],[Column52]]&AM324","v":""}]
[322,null,null,null,null,null,null,null,null,null,null,null,null,null,null,null,null,null,null,null,"--",{"$f":"IF(U323=\"--\",0,U323)","v":0},null,null,{"$f":"(K323/Instructions!$C$23)*100","v":0},{"$f":"(L323/Instructions!$C$24)*100","v":0},{"$f":"(M323/Instructions!$C$25)*100","v":0},{"$f":"(N323/Instructions!$C$26)*100","v":0},{"$f":"(O323/Instructions!$C$27)*100","v":0},{"$f":"(U323/'Report Card'!$H$22)*100","v":{"$error":"#VALUE!"}},{"$f":"IF(AND(Y323>=33,Z323>=33,AA323>=33,AB323>=33,AC323>=33),\"PASS\",\"----\")","v":"----"},"E","E","E","E","E",{"$f":"IFERROR(IF(AD323>90,\"A+\",IF(AD323>80,\"A\",IF(AD323>70,\"B+\",IF(AD323>60,\"B\",IF(AD323>50,\"C+\",IF(AD323>40,\"C\",IF(AD323>=33,\"D\",\"E\"))))))),\"--\")","v":"--"},null,null,null,null,null,{"$f":"Table_2[[#This Row],[Column51]]&Table_2[[#This Row],[Column52]]&AM325","v":""}]
[323,null,null,null,null,null,null,null,null,null,null,null,null,null,null,null,null,null,null,null,"--",0,null,null,{"$f":"(K324/Instructions!$C$23)*100","v":0},{"$f":"(L324/Instructions!$C$24)*100","v":0},{"$f":"(M324/Instructions!$C$25)*100","v":0},{"$f":"(N324/Instructions!$C$26)*100","v":0},{"$f":"(O324/Instructions!$C$27)*100","v":0},{"$f":"(U324/'Report Card'!$H$22)*100","v":{"$error":"#VALUE!"}},"----","E","E","E","E","E","--",null,null,null,null,null,{"$f":"Table_2[[#This Row],[Column51]]&Table_2[[#This Row],[Column52]]&AM326","v":""}]
[324,null,null,null,null,null,null,null,null,null,null,null,null,null,null,null,null,null,null,null,"--",0,null,null,{"$f":"(K325/Instructions!$C$23)*100","v":0},{"$f":"(L325/Instructions!$C$24)*100","v":0},{"$f":"(M325/Instructions!$C$25)*100","v":0},{"$f":"(N325/Instructions!$C$26)*100","v":0},{"$f":"(O325/Instructions!$C$27)*100","v":0},{"$f":"(U325/'Report Card'!$H$22)*100","v":{"$error":"#VALUE!"}},"----","E","E","E","E","E","--",null,null,null,null,null,{"$f":"Table_2[[#This Row],[Column51]]&Table_2[[#This Row],[Column52]]&AM327","v":""}]
[325,null,null,null,null,null,null,null,null,null,null,null,null,null,null,null,null,null,null,null,"--",0,null,null,{"$f":"(K326/Instructions!$C$23)*100","v":0},{"$f":"(L326/Instructions!$C$24)*100","v":0},{"$f":"(M326/Instructions!$C$25)*100","v":0},{"$f":"(N326/Instructions!$C$26)*100","v":0},{"$f":"(O326/Instructions!$C$27)*100","v":0},{"$f":"(U326/'Report Card'!$H$22)*100","v":{"$error":"#VALUE!"}},"----","E","E","E","E","E","--",null,null,null,null,null,{"$f":"Table_2[[#This Row],[Column51]]&Table_2[[#This Row],[Column52]]&AM328","v":""}]
[326,null,null,null,null,null,null,null,null,null,null,null,null,null,null,null,null,null,null,null,"--",0,null,null,{"$f":"(K327/Instructions!$C$23)*100","v":0},{"$f":"(L327/Instructions!$C$24)*100","v":0},{"$f":"(M327/Instructions!$C$25)*100","v":0},{"$f":"(N327/Instructions!$C$26)*100","v":0},{"$f":"(O327/Instructions!$C$27)*100","v":0},{"$f":"(U327/'Report Card'!$H$22)*100","v":{"$error":"#VALUE!"}},"----","E","E","E","E","E","--",null,null,null,null,null,{"$f":"Table_2[[#This Row],[Column51]]&Table_2[[#This Row],[Column52]]&AM329","v":""}]
[327,null,null,null,null,null,null,null,null,null,null,null,null,null,null,null,null,null,null,null,"--",0,null,null,{"$f":"(K328/Instructions!$C$23)*100","v":0},{"$f":"(L328/Instructions!$C$24)*100","v":0},{"$f":"(M328/Instructions!$C$25)*100","v":0},{"$f":"(N328/Instructions!$C$26)*100","v":0},{"$f":"(O328/Instructions!$C$27)*100","v":0},{"$f":"(U328/'Report Card'!$H$22)*100","v":{"$error":"#VALUE!"}},"----","E","E","E","E","E","--",null,null,null,null,null,{"$f":"Table_2[[#This Row],[Column51]]&Table_2[[#This Row],[Column52]]&AM330","v":""}]
[328,null,null,null,null,null,null,null,null,null,null,null,null,null,null,null,null,null,null,null,"--",0,null,null,{"$f":"(K329/Instructions!$C$23)*100","v":0},{"$f":"(L329/Instructions!$C$24)*100","v":0},{"$f":"(M329/Instructions!$C$25)*100","v":0},{"$f":"(N329/Instructions!$C$26)*100","v":0},{"$f":"(O329/Instructions!$C$27)*100","v":0},{"$f":"(U329/'Report Card'!$H$22)*100","v":{"$error":"#VALUE!"}},"----","E","E","E","E","E","--",null,null,null,null,null,{"$f":"Table_2[[#This Row],[Column51]]&Table_2[[#This Row],[Column52]]&AM331","v":""}]
[329,null,null,null,null,null,null,null,null,null,null,null,null,null,null,null,null,null,null,null,"--",0,null,null,{"$f":"(K330/Instructions!$C$23)*100","v":0},{"$f":"(L330/Instructions!$C$24)*100","v":0},{"$f":"(M330/Instructions!$C$25)*100","v":0},{"$f":"(N330/Instructions!$C$26)*100","v":0},{"$f":"(O330/Instructions!$C$27)*100","v":0},{"$f":"(U330/'Report Card'!$H$22)*100","v":{"$error":"#VALUE!"}},"----","E","E","E","E","E","--",null,null,null,null,null,{"$f":"Table_2[[#This Row],[Column51]]&Table_2[[#This Row],[Column52]]&AM332","v":""}]
[330,null,null,null,null,null,null,null,null,null,null,null,null,null,null,null,null,null,null,null,"--",0,null,null,{"$f":"(K331/Instructions!$C$23)*100","v":0},{"$f":"(L331/Instructions!$C$24)*100","v":0},{"$f":"(M331/Instructions!$C$25)*100","v":0},{"$f":"(N331/Instructions!$C$26)*100","v":0},{"$f":"(O331/Instructions!$C$27)*100","v":0},{"$f":"(U331/'Report Card'!$H$22)*100","v":{"$error":"#VALUE!"}},"----","E","E","E","E","E","--",null,null,null,null,null,{"$f":"Table_2[[#This Row],[Column51]]&Table_2[[#This Row],[Column52]]&AM333","v":""}]
[331,null,null,null,null,null,null,null,null,null,null,null,null,null,null,null,null,null,null,null,"--",0,null,null,{"$f":"(K332/Instructions!$C$23)*100","v":0},{"$f":"(L332/Instructions!$C$24)*100","v":0},{"$f":"(M332/Instructions!$C$25)*100","v":0},{"$f":"(N332/Instructions!$C$26)*100","v":0},{"$f":"(O332/Instructions!$C$27)*100","v":0},{"$f":"(U332/'Report Card'!$H$22)*100","v":{"$error":"#VALUE!"}},"----","E","E","E","E","E","--",null,null,null,null,null,{"$f":"Table_2[[#This Row],[Column51]]&Table_2[[#This Row],[Column52]]&AM334","v":""}]
[332,null,null,null,null,null,null,null,null,null,null,null,null,null,null,null,null,null,null,null,"--",0,null,null,{"$f":"(K333/Instructions!$C$23)*100","v":0},{"$f":"(L333/Instructions!$C$24)*100","v":0},{"$f":"(M333/Instructions!$C$25)*100","v":0},{"$f":"(N333/Instructions!$C$26)*100","v":0},{"$f":"(O333/Instructions!$C$27)*100","v":0},{"$f":"(U333/'Report Card'!$H$22)*100","v":{"$error":"#VALUE!"}},"----","E","E","E","E","E","--",null,null,null,null,null,{"$f":"Table_2[[#This Row],[Column51]]&Table_2[[#This Row],[Column52]]&AM335","v":""}]
[333,null,null,null,null,null,null,null,null,null,null,null,null,null,null,null,null,null,null,null,"--",0,null,null,{"$f":"(K334/Instructions!$C$23)*100","v":0},{"$f":"(L334/Instructions!$C$24)*100","v":0},{"$f":"(M334/Instructions!$C$25)*100","v":0},{"$f":"(N334/Instructions!$C$26)*100","v":0},{"$f":"(O334/Instructions!$C$27)*100","v":0},{"$f":"(U334/'Report Card'!$H$22)*100","v":{"$error":"#VALUE!"}},"----","E","E","E","E","E","--",null,null,null,null,null,{"$f":"Table_2[[#This Row],[Column51]]&Table_2[[#This Row],[Column52]]&AM336","v":""}]
[334,null,null,null,null,null,null,null,null,null,null,null,null,null,null,null,null,null,null,null,"--",0,null,null,{"$f":"(K335/Instructions!$C$23)*100","v":0},{"$f":"(L335/Instructions!$C$24)*100","v":0},{"$f":"(M335/Instructions!$C$25)*100","v":0},{"$f":"(N335/Instructions!$C$26)*100","v":0},{"$f":"(O335/Instructions!$C$27)*100","v":0},{"$f":"(U335/'Report Card'!$H$22)*100","v":{"$error":"#VALUE!"}},"----","E","E","E","E","E","--",null,null,null,null,null,{"$f":"Table_2[[#This Row],[Column51]]&Table_2[[#This Row],[Column52]]&AM337","v":""}]
[335,null,null,null,null,null,null,null,null,null,null,null,null,null,null,null,null,null,null,null,"--",0,null,null,{"$f":"(K336/Instructions!$C$23)*100","v":0},{"$f":"(L336/Instructions!$C$24)*100","v":0},{"$f":"(M336/Instructions!$C$25)*100","v":0},{"$f":"(N336/Instructions!$C$26)*100","v":0},{"$f":"(O336/Instructions!$C$27)*100","v":0},{"$f":"(U336/'Report Card'!$H$22)*100","v":{"$error":"#VALUE!"}},"----","E","E","E","E","E","--",null,null,null,null,null,{"$f":"Table_2[[#This Row],[Column51]]&Table_2[[#This Row],[Column52]]&AM338","v":""}]
[336,null,null,null,null,null,null,null,null,null,null,null,null,null,null,null,null,null,null,null,"--",0,null,null,{"$f":"(K337/Instructions!$C$23)*100","v":0},{"$f":"(L337/Instructions!$C$24)*100","v":0},{"$f":"(M337/Instructions!$C$25)*100","v":0},{"$f":"(N337/Instructions!$C$26)*100","v":0},{"$f":"(O337/Instructions!$C$27)*100","v":0},{"$f":"(U337/'Report Card'!$H$22)*100","v":{"$error":"#VALUE!"}},"----","E","E","E","E","E","--",null,null,null,null,null,{"$f":"Table_2[[#This Row],[Column51]]&Table_2[[#This Row],[Column52]]&AM339","v":""}]
[337,null,null,null,null,null,null,null,null,null,null,null,null,null,null,null,null,null,null,null,"--",0,null,null,{"$f":"(K338/Instructions!$C$23)*100","v":0},{"$f":"(L338/Instructions!$C$24)*100","v":0},{"$f":"(M338/Instructions!$C$25)*100","v":0},{"$f":"(N338/Instructions!$C$26)*100","v":0},{"$f":"(O338/Instructions!$C$27)*100","v":0},{"$f":"(U338/'Report Card'!$H$22)*100","v":{"$error":"#VALUE!"}},"----","E","E","E","E","E","--",null,null,null,null,null,{"$f":"Table_2[[#This Row],[Column51]]&Table_2[[#This Row],[Column52]]&AM340","v":""}]
[338,null,null,null,null,null,null,null,null,null,null,null,null,null,null,null,null,null,null,null,"--",0,null,null,{"$f":"(K339/Instructions!$C$23)*100","v":0},{"$f":"(L339/Instructions!$C$24)*100","v":0},{"$f":"(M339/Instructions!$C$25)*100","v":0},{"$f":"(N339/Instructions!$C$26)*100","v":0},{"$f":"(O339/Instructions!$C$27)*100","v":0},{"$f":"(U339/'Report Card'!$H$22)*100","v":{"$error":"#VALUE!"}},"----","E","E","E","E","E","--",null,null,null,null,null,{"$f":"Table_2[[#This Row],[Column51]]&Table_2[[#This Row],[Column52]]&AM341","v":""}]
[339,null,null,null,null,null,null,null,null,null,null,null,null,null,null,null,null,null,null,null,"--",0,null,null,{"$f":"(K340/Instructions!$C$23)*100","v":0},{"$f":"(L340/Instructions!$C$24)*100","v":0},{"$f":"(M340/Instructions!$C$25)*100","v":0},{"$f":"(N340/Instructions!$C$26)*100","v":0},{"$f":"(O340/Instructions!$C$27)*100","v":0},{"$f":"(U340/'Report Card'!$H$22)*100","v":{"$error":"#VALUE!"}},"----","E","E","E","E","E","--",null,null,null,null,null,{"$f":"Table_2[[#This Row],[Column51]]&Table_2[[#This Row],[Column52]]&AM342","v":""}]
[340,null,null,null,null,null,null,null,null,null,null,null,null,null,null,null,null,null,null,null,"--",0,null,null,{"$f":"(K341/Instructions!$C$23)*100","v":0},{"$f":"(L341/Instructions!$C$24)*100","v":0},{"$f":"(M341/Instructions!$C$25)*100","v":0},{"$f":"(N341/Instructions!$C$26)*100","v":0},{"$f":"(O341/Instructions!$C$27)*100","v":0},{"$f":"(U341/'Report Card'!$H$22)*100","v":{"$error":"#VALUE!"}},"----","E","E","E","E","E","--",null,null,null,null,null,{"$f":"Table_2[[#This Row],[Column51]]&Table_2[[#This Row],[Column52]]&AM343","v":""}]
[341,null,null,null,null,null,null,null,null,null,null,null,null,null,null,null,null,null,null,null,"--",0,null,null,{"$f":"(K342/Instructions!$C$23)*100","v":0},{"$f":"(L342/Instructions!$C$24)*100","v":0},{"$f":"(M342/Instructions!$C$25)*100","v":0},{"$f":"(N342/Instructions!$C$26)*100","v":0},{"$f":"(O342/Instructions!$C$27)*100","v":0},{"$f":"(U342/'Report Card'!$H$22)*100","v":{"$error":"#VALUE!"}},"----","E","E","E","E","E","--",null,null,null,null,null,{"$f":"Table_2[[#This Row],[Column51]]&Table_2[[#This Row],[Column52]]&AM344","v":""}]
[342,null,null,null,null,null,null,null,null,null,null,null,null,null,null,null,null,null,null,null,"--",0,null,null,{"$f":"(K343/Instructions!$C$23)*100","v":0},{"$f":"(L343/Instructions!$C$24)*100","v":0},{"$f":"(M343/Instructions!$C$25)*100","v":0},{"$f":"(N343/Instructions!$C$26)*100","v":0},{"$f":"(O343/Instructions!$C$27)*100","v":0},{"$f":"(U343/'Report Card'!$H$22)*100","v":{"$error":"#VALUE!"}},"----","E","E","E","E","E","--",null,null,null,null,null,{"$f":"Table_2[[#This Row],[Column51]]&Table_2[[#This Row],[Column52]]&AM345","v":""}]
[343,null,null,null,null,null,null,null,null,null,null,null,null,null,null,null,null,null,null,null,"--",0,null,null,{"$f":"(K344/Instructions!$C$23)*100","v":0},{"$f":"(L344/Instructions!$C$24)*100","v":0},{"$f":"(M344/Instructions!$C$25)*100","v":0},{"$f":"(N344/Instructions!$C$26)*100","v":0},{"$f":"(O344/Instructions!$C$27)*100","v":0},{"$f":"(U344/'Report Card'!$H$22)*100","v":{"$error":"#VALUE!"}},"----","E","E","E","E","E","--",null,null,null,null,null,{"$f":"Table_2[[#This Row],[Column51]]&Table_2[[#This Row],[Column52]]&AM346","v":""}]
[344,null,null,null,null,null,null,null,null,null,null,null,null,null,null,null,null,null,null,null,"--",0,null,null,{"$f":"(K345/Instructions!$C$23)*100","v":0},{"$f":"(L345/Instructions!$C$24)*100","v":0},{"$f":"(M345/Instructions!$C$25)*100","v":0},{"$f":"(N345/Instructions!$C$26)*100","v":0},{"$f":"(O345/Instructions!$C$27)*100","v":0},{"$f":"(U345/'Report Card'!$H$22)*100","v":{"$error":"#VALUE!"}},"----","E","E","E","E","E","--",null,null,null,null,null,{"$f":"Table_2[[#This Row],[Column51]]&Table_2[[#This Row],[Column52]]&AM347","v":""}]
[345,null,null,null,null,null,null,null,null,null,null,null,null,null,null,null,null,null,null,null,"--",0,null,null,{"$f":"(K346/Instructions!$C$23)*100","v":0},{"$f":"(L346/Instructions!$C$24)*100","v":0},{"$f":"(M346/Instructions!$C$25)*100","v":0},{"$f":"(N346/Instructions!$C$26)*100","v":0},{"$f":"(O346/Instructions!$C$27)*100","v":0},{"$f":"(U346/'Report Card'!$H$22)*100","v":{"$error":"#VALUE!"}},"----","E","E","E","E","E","--",null,null,null,null,null,{"$f":"Table_2[[#This Row],[Column51]]&Table_2[[#This Row],[Column52]]&AM348","v":""}]
[346,null,null,null,null,null,null,null,null,null,null,null,null,null,null,null,null,null,null,null,"--",0,null,null,{"$f":"(K347/Instructions!$C$23)*100","v":0},{"$f":"(L347/Instructions!$C$24)*100","v":0},{"$f":"(M347/Instructions!$C$25)*100","v":0},{"$f":"(N347/Instructions!$C$26)*100","v":0},{"$f":"(O347/Instructions!$C$27)*100","v":0},{"$f":"(U347/'Report Card'!$H$22)*100","v":{"$error":"#VALUE!"}},"----","E","E","E","E","E","--",null,null,null,null,null,{"$f":"Table_2[[#This Row],[Column51]]&Table_2[[#This Row],[Column52]]&AM349","v":""}]
[347,null,null,null,null,null,null,null,null,null,null,null,null,null,null,null,null,null,null,null,"--",0,null,null,{"$f":"(K348/Instructions!$C$23)*100","v":0},{"$f":"(L348/Instructions!$C$24)*100","v":0},{"$f":"(M348/Instructions!$C$25)*100","v":0},{"$f":"(N348/Instructions!$C$26)*100","v":0},{"$f":"(O348/Instructions!$C$27)*100","v":0},{"$f":"(U348/'Report Card'!$H$22)*100","v":{"$error":"#VALUE!"}},"----","E","E","E","E","E","--",null,null,null,null,null,{"$f":"Table_2[[#This Row],[Column51]]&Table_2[[#This Row],[Column52]]&AM350","v":""}]
[348,null,null,null,null,null,null,null,null,null,null,null,null,null,null,null,null,null,null,null,"--",0,null,null,{"$f":"(K349/Instructions!$C$23)*100","v":0},{"$f":"(L349/Instructions!$C$24)*100","v":0},{"$f":"(M349/Instructions!$C$25)*100","v":0},{"$f":"(N349/Instructions!$C$26)*100","v":0},{"$f":"(O349/Instructions!$C$27)*100","v":0},{"$f":"(U349/'Report Card'!$H$22)*100","v":{"$error":"#VALUE!"}},"----","E","E","E","E","E","--",null,null,null,null,null,{"$f":"Table_2[[#This Row],[Column51]]&Table_2[[#This Row],[Column52]]&AM351","v":""}]
[349,null,null,null,null,null,null,null,null,null,null,null,null,null,null,null,null,null,null,null,"--",0,null,null,{"$f":"(K350/Instructions!$C$23)*100","v":0},{"$f":"(L350/Instructions!$C$24)*100","v":0},{"$f":"(M350/Instructions!$C$25)*100","v":0},{"$f":"(N350/Instructions!$C$26)*100","v":0},{"$f":"(O350/Instructions!$C$27)*100","v":0},{"$f":"(U350/'Report Card'!$H$22)*100","v":{"$error":"#VALUE!"}},"----","E","E","E","E","E","--",null,null,null,null,null,{"$f":"Table_2[[#This Row],[Column51]]&Table_2[[#This Row],[Column52]]&AM352","v":""}]
[350,null,null,null,null,null,null,null,null,null,null,null,null,null,null,null,null,null,null,null,"--",0,null,null,{"$f":"(K351/Instructions!$C$23)*100","v":0},{"$f":"(L351/Instructions!$C$24)*100","v":0},{"$f":"(M351/Instructions!$C$25)*100","v":0},{"$f":"(N351/Instructions!$C$26)*100","v":0},{"$f":"(O351/Instructions!$C$27)*100","v":0},{"$f":"(U351/'Report Card'!$H$22)*100","v":{"$error":"#VALUE!"}},"----","E","E","E","E","E","--",null,null,null,null,null,{"$f":"Table_2[[#This Row],[Column51]]&Table_2[[#This Row],[Column52]]&AM353","v":""}]
[351,null,null,null,null,null,null,null,null,null,null,null,null,null,null,null,null,null,null,null,"--",0,null,null,{"$f":"(K352/Instructions!$C$23)*100","v":0},{"$f":"(L352/Instructions!$C$24)*100","v":0},{"$f":"(M352/Instructions!$C$25)*100","v":0},{"$f":"(N352/Instructions!$C$26)*100","v":0},{"$f":"(O352/Instructions!$C$27)*100","v":0},{"$f":"(U352/'Report Card'!$H$22)*100","v":{"$error":"#VALUE!"}},"----","E","E","E","E","E","--",null,null,null,null,null,{"$f":"Table_2[[#This Row],[Column51]]&Table_2[[#This Row],[Column52]]&AM354","v":""}]
[352,null,null,null,null,null,null,null,null,null,null,null,null,null,null,null,null,null,null,null,"--",0,null,null,{"$f":"(K353/Instructions!$C$23)*100","v":0},{"$f":"(L353/Instructions!$C$24)*100","v":0},{"$f":"(M353/Instructions!$C$25)*100","v":0},{"$f":"(N353/Instructions!$C$26)*100","v":0},{"$f":"(O353/Instructions!$C$27)*100","v":0},{"$f":"(U353/'Report Card'!$H$22)*100","v":{"$error":"#VALUE!"}},"----","E","E","E","E","E","--",null,null,null,null,null,{"$f":"Table_2[[#This Row],[Column51]]&Table_2[[#This Row],[Column52]]&AM355","v":""}]
[353,null,null,null,null,null,null,null,null,null,null,null,null,null,null,null,null,null,null,null,"--",0,null,null,{"$f":"(K354/Instructions!$C$23)*100","v":0},{"$f":"(L354/Instructions!$C$24)*100","v":0},{"$f":"(M354/Instructions!$C$25)*100","v":0},{"$f":"(N354/Instructions!$C$26)*100","v":0},{"$f":"(O354/Instructions!$C$27)*100","v":0},{"$f":"(U354/'Report Card'!$H$22)*100","v":{"$error":"#VALUE!"}},"----","E","E","E","E","E","--",null,null,null,null,null,{"$f":"Table_2[[#This Row],[Column51]]&Table_2[[#This Row],[Column52]]&AM356","v":""}]
[354,null,null,null,null,null,null,null,null,null,null,null,null,null,null,null,null,null,null,null,"--",0,null,null,{"$f":"(K355/Instructions!$C$23)*100","v":0},{"$f":"(L355/Instructions!$C$24)*100","v":0},{"$f":"(M355/Instructions!$C$25)*100","v":0},{"$f":"(N355/Instructions!$C$26)*100","v":0},{"$f":"(O355/Instructions!$C$27)*100","v":0},{"$f":"(U355/'Report Card'!$H$22)*100","v":{"$error":"#VALUE!"}},"----","E","E","E","E","E","--",null,null,null,null,null,{"$f":"Table_2[[#This Row],[Column51]]&Table_2[[#This Row],[Column52]]&AM357","v":""}]
[355,null,null,null,null,null,null,null,null,null,null,null,null,null,null,null,null,null,null,null,"--",0,null,null,{"$f":"(K356/Instructions!$C$23)*100","v":0},{"$f":"(L356/Instructions!$C$24)*100","v":0},{"$f":"(M356/Instructions!$C$25)*100","v":0},{"$f":"(N356/Instructions!$C$26)*100","v":0},{"$f":"(O356/Instructions!$C$27)*100","v":0},{"$f":"(U356/'Report Card'!$H$22)*100","v":{"$error":"#VALUE!"}},"----","E","E","E","E","E","--",null,null,null,null,null,{"$f":"Table_2[[#This Row],[Column51]]&Table_2[[#This Row],[Column52]]&AM358","v":""}]
[356,null,null,null,null,null,null,null,null,null,null,null,null,null,null,null,null,null,null,null,"--",0,null,null,{"$f":"(K357/Instructions!$C$23)*100","v":0},{"$f":"(L357/Instructions!$C$24)*100","v":0},{"$f":"(M357/Instructions!$C$25)*100","v":0},{"$f":"(N357/Instructions!$C$26)*100","v":0},{"$f":"(O357/Instructions!$C$27)*100","v":0},{"$f":"(U357/'Report Card'!$H$22)*100","v":{"$error":"#VALUE!"}},"----","E","E","E","E","E","--",null,null,null,null,null,{"$f":"Table_2[[#This Row],[Column51]]&Table_2[[#This Row],[Column52]]&AM359","v":""}]
[357,null,null,null,null,null,null,null,null,null,null,null,null,null,null,null,null,null,null,null,"--",0,null,null,{"$f":"(K358/Instructions!$C$23)*100","v":0},{"$f":"(L358/Instructions!$C$24)*100","v":0},{"$f":"(M358/Instructions!$C$25)*100","v":0},{"$f":"(N358/Instructions!$C$26)*100","v":0},{"$f":"(O358/Instructions!$C$27)*100","v":0},{"$f":"(U358/'Report Card'!$H$22)*100","v":{"$error":"#VALUE!"}},"----","E","E","E","E","E","--",null,null,null,null,null,{"$f":"Table_2[[#This Row],[Column51]]&Table_2[[#This Row],[Column52]]&AM360","v":""}]
[358,null,null,null,null,null,null,null,null,null,null,null,null,null,null,null,null,null,null,null,"--",0,null,null,{"$f":"(K359/Instructions!$C$23)*100","v":0},{"$f":"(L359/Instructions!$C$24)*100","v":0},{"$f":"(M359/Instructions!$C$25)*100","v":0},{"$f":"(N359/Instructions!$C$26)*100","v":0},{"$f":"(O359/Instructions!$C$27)*100","v":0},{"$f":"(U359/'Report Card'!$H$22)*100","v":{"$error":"#VALUE!"}},"----","E","E","E","E","E","--",null,null,null,null,null,{"$f":"Table_2[[#This Row],[Column51]]&Table_2[[#This Row],[Column52]]&AM361","v":""}]
[359,null,null,null,null,null,null,null,null,null,null,null,null,null,null,null,null,null,null,null,"--",0,null,null,{"$f":"(K360/Instructions!$C$23)*100","v":0},{"$f":"(L360/Instructions!$C$24)*100","v":0},{"$f":"(M360/Instructions!$C$25)*100","v":0},{"$f":"(N360/Instructions!$C$26)*100","v":0},{"$f":"(O360/Instructions!$C$27)*100","v":0},{"$f":"(U360/'Report Card'!$H$22)*100","v":{"$error":"#VALUE!"}},"----","E","E","E","E","E","--",null,null,null,null,null,{"$f":"Table_2[[#This Row],[Column51]]&Table_2[[#This Row],[Column52]]&AM362","v":""}]
[360,null,null,null,null,null,null,null,null,null,null,null,null,null,null,null,null,null,null,null,"--",0,null,null,{"$f":"(K361/Instructions!$C$23)*100","v":0},{"$f":"(L361/Instructions!$C$24)*100","v":0},{"$f":"(M361/Instructions!$C$25)*100","v":0},{"$f":"(N361/Instructions!$C$26)*100","v":0},{"$f":"(O361/Instructions!$C$27)*100","v":0},{"$f":"(U361/'Report Card'!$H$22)*100","v":{"$error":"#VALUE!"}},"----","E","E","E","E","E","--",null,null,null,null,null,{"$f":"Table_2[[#This Row],[Column51]]&Table_2[[#This Row],[Column52]]&AM363","v":""}]
[361,null,null,null,null,null,null,null,null,null,null,null,null,null,null,null,null,null,null,null,"--",0,null,null,{"$f":"(K362/Instructions!$C$23)*100","v":0},{"$f":"(L362/Instructions!$C$24)*100","v":0},{"$f":"(M362/Instructions!$C$25)*100","v":0},{"$f":"(N362/Instructions!$C$26)*100","v":0},{"$f":"(O362/Instructions!$C$27)*100","v":0},{"$f":"(U362/'Report Card'!$H$22)*100","v":{"$error":"#VALUE!"}},"----","E","E","E","E","E","--",null,null,null,null,null,{"$f":"Table_2[[#This Row],[Column51]]&Table_2[[#This Row],[Column52]]&AM364","v":""}]
[362,null,null,null,null,null,null,null,null,null,null,null,null,null,null,null,null,null,null,null,"--",0,null,null,{"$f":"(K363/Instructions!$C$23)*100","v":0},{"$f":"(L363/Instructions!$C$24)*100","v":0},{"$f":"(M363/Instructions!$C$25)*100","v":0},{"$f":"(N363/Instructions!$C$26)*100","v":0},{"$f":"(O363/Instructions!$C$27)*100","v":0},{"$f":"(U363/'Report Card'!$H$22)*100","v":{"$error":"#VALUE!"}},"----","E","E","E","E","E","--",null,null,null,null,null,{"$f":"Table_2[[#This Row],[Column51]]&Table_2[[#This Row],[Column52]]&AM365","v":""}]
[363,null,null,null,null,null,null,null,null,null,null,null,null,null,null,null,null,null,null,null,"--",0,null,null,{"$f":"(K364/Instructions!$C$23)*100","v":0},{"$f":"(L364/Instructions!$C$24)*100","v":0},{"$f":"(M364/Instructions!$C$25)*100","v":0},{"$f":"(N364/Instructions!$C$26)*100","v":0},{"$f":"(O364/Instructions!$C$27)*100","v":0},{"$f":"(U364/'Report Card'!$H$22)*100","v":{"$error":"#VALUE!"}},"----","E","E","E","E","E","--",null,null,null,null,null,{"$f":"Table_2[[#This Row],[Column51]]&Table_2[[#This Row],[Column52]]&AM366","v":""}]
[364,null,null,null,null,null,null,null,null,null,null,null,null,null,null,null,null,null,null,null,"--",0,null,null,{"$f":"(K365/Instructions!$C$23)*100","v":0},{"$f":"(L365/Instructions!$C$24)*100","v":0},{"$f":"(M365/Instructions!$C$25)*100","v":0},{"$f":"(N365/Instructions!$C$26)*100","v":0},{"$f":"(O365/Instructions!$C$27)*100","v":0},{"$f":"(U365/'Report Card'!$H$22)*100","v":{"$error":"#VALUE!"}},"----","E","E","E","E","E","--",null,null,null,null,null,{"$f":"Table_2[[#This Row],[Column51]]&Table_2[[#This Row],[Column52]]&AM367","v":""}]
[365,null,null,null,null,null,null,null,null,null,null,null,null,null,null,null,null,null,null,null,"--",0,null,null,{"$f":"(K366/Instructions!$C$23)*100","v":0},{"$f":"(L366/Instructions!$C$24)*100","v":0},{"$f":"(M366/Instructions!$C$25)*100","v":0},{"$f":"(N366/Instructions!$C$26)*100","v":0},{"$f":"(O366/Instructions!$C$27)*100","v":0},{"$f":"(U366/'Report Card'!$H$22)*100","v":{"$error":"#VALUE!"}},"----","E","E","E","E","E","--",null,null,null,null,null,{"$f":"Table_2[[#This Row],[Column51]]&Table_2[[#This Row],[Column52]]&AM368","v":""}]
[366,null,null,null,null,null,null,null,null,null,null,null,null,null,null,null,null,null,null,null,"--",0,null,null,{"$f":"(K367/Instructions!$C$23)*100","v":0},{"$f":"(L367/Instructions!$C$24)*100","v":0},{"$f":"(M367/Instructions!$C$25)*100","v":0},{"$f":"(N367/Instructions!$C$26)*100","v":0},{"$f":"(O367/Instructions!$C$27)*100","v":0},{"$f":"(U367/'Report Card'!$H$22)*100","v":{"$error":"#VALUE!"}},"----","E","E","E","E","E","--",null,null,null,null,null,{"$f":"Table_2[[#This Row],[Column51]]&Table_2[[#This Row],[Column52]]&AM369","v":""}]
[367,null,null,null,null,null,null,null,null,null,null,null,null,null,null,null,null,null,null,null,"--",0,null,null,{"$f":"(K368/Instructions!$C$23)*100","v":0},{"$f":"(L368/Instructions!$C$24)*100","v":0},{"$f":"(M368/Instructions!$C$25)*100","v":0},{"$f":"(N368/Instructions!$C$26)*100","v":0},{"$f":"(O368/Instructions!$C$27)*100","v":0},{"$f":"(U368/'Report Card'!$H$22)*100","v":{"$error":"#VALUE!"}},"----","E","E","E","E","E","--",null,null,null,null,null,{"$f":"Table_2[[#This Row],[Column51]]&Table_2[[#This Row],[Column52]]&AM370","v":""}]
[368,null,null,null,null,null,null,null,null,null,null,null,null,null,null,null,null,null,null,null,"--",0,null,null,{"$f":"(K369/Instructions!$C$23)*100","v":0},{"$f":"(L369/Instructions!$C$24)*100","v":0},{"$f":"(M369/Instructions!$C$25)*100","v":0},{"$f":"(N369/Instructions!$C$26)*100","v":0},{"$f":"(O369/Instructions!$C$27)*100","v":0},{"$f":"(U369/'Report Card'!$H$22)*100","v":{"$error":"#VALUE!"}},"----","E","E","E","E","E","--",null,null,null,null,null,{"$f":"Table_2[[#This Row],[Column51]]&Table_2[[#This Row],[Column52]]&AM371","v":""}]
[369,null,null,null,null,null,null,null,null,null,null,null,null,null,null,null,null,null,null,null,"--",0,null,null,{"$f":"(K370/Instructions!$C$23)*100","v":0},{"$f":"(L370/Instructions!$C$24)*100","v":0},{"$f":"(M370/Instructions!$C$25)*100","v":0},{"$f":"(N370/Instructions!$C$26)*100","v":0},{"$f":"(O370/Instructions!$C$27)*100","v":0},{"$f":"(U370/'Report Card'!$H$22)*100","v":{"$error":"#VALUE!"}},"----","E","E","E","E","E","--",null,null,null,null,null,{"$f":"Table_2[[#This Row],[Column51]]&Table_2[[#This Row],[Column52]]&AM372","v":""}]
[370,null,null,null,null,null,null,null,null,null,null,null,null,null,null,null,null,null,null,null,"--",0,null,null,{"$f":"(K371/Instructions!$C$23)*100","v":0},{"$f":"(L371/Instructions!$C$24)*100","v":0},{"$f":"(M371/Instructions!$C$25)*100","v":0},{"$f":"(N371/Instructions!$C$26)*100","v":0},{"$f":"(O371/Instructions!$C$27)*100","v":0},{"$f":"(U371/'Report Card'!$H$22)*100","v":{"$error":"#VALUE!"}},"----","E","E","E","E","E","--",null,null,null,null,null,{"$f":"Table_2[[#This Row],[Column51]]&Table_2[[#This Row],[Column52]]&AM373","v":""}]
[371,null,null,null,null,null,null,null,null,null,null,null,null,null,null,null,null,null,null,null,"--",0,null,null,{"$f":"(K372/Instructions!$C$23)*100","v":0},{"$f":"(L372/Instructions!$C$24)*100","v":0},{"$f":"(M372/Instructions!$C$25)*100","v":0},{"$f":"(N372/Instructions!$C$26)*100","v":0},{"$f":"(O372/Instructions!$C$27)*100","v":0},{"$f":"(U372/'Report Card'!$H$22)*100","v":{"$error":"#VALUE!"}},"----","E","E","E","E","E","--",null,null,null,null,null,{"$f":"Table_2[[#This Row],[Column51]]&Table_2[[#This Row],[Column52]]&AM374","v":""}]
[372,null,null,null,null,null,null,null,null,null,null,null,null,null,null,null,null,null,null,null,"--",0,null,null,{"$f":"(K373/Instructions!$C$23)*100","v":0},{"$f":"(L373/Instructions!$C$24)*100","v":0},{"$f":"(M373/Instructions!$C$25)*100","v":0},{"$f":"(N373/Instructions!$C$26)*100","v":0},{"$f":"(O373/Instructions!$C$27)*100","v":0},{"$f":"(U373/'Report Card'!$H$22)*100","v":{"$error":"#VALUE!"}},"----","E","E","E","E","E","--",null,null,null,null,null,{"$f":"Table_2[[#This Row],[Column51]]&Table_2[[#This Row],[Column52]]&AM375","v":""}]
[373,null,null,null,null,null,null,null,null,null,null,null,null,null,null,null,null,null,null,null,"--",0,null,null,{"$f":"(K374/Instructions!$C$23)*100","v":0},{"$f":"(L374/Instructions!$C$24)*100","v":0},{"$f":"(M374/Instructions!$C$25)*100","v":0},{"$f":"(N374/Instructions!$C$26)*100","v":0},{"$f":"(O374/Instructions!$C$27)*100","v":0},{"$f":"(U374/'Report Card'!$H$22)*100","v":{"$error":"#VALUE!"}},"----","E","E","E","E","E","--",null,null,null,null,null,{"$f":"Table_2[[#This Row],[Column51]]&Table_2[[#This Row],[Column52]]&AM376","v":""}]
[374,null,null,null,null,null,null,null,null,null,null,null,null,null,null,null,null,null,null,null,"--",0,null,null,{"$f":"(K375/Instructions!$C$23)*100","v":0},{"$f":"(L375/Instructions!$C$24)*100","v":0},{"$f":"(M375/Instructions!$C$25)*100","v":0},{"$f":"(N375/Instructions!$C$26)*100","v":0},{"$f":"(O375/Instructions!$C$27)*100","v":0},{"$f":"(U375/'Report Card'!$H$22)*100","v":{"$error":"#VALUE!"}},"----","E","E","E","E","E","--",null,null,null,null,null,{"$f":"Table_2[[#This Row],[Column51]]&Table_2[[#This Row],[Column52]]&AM377","v":""}]
[375,null,null,null,null,null,null,null,null,null,null,null,null,null,null,null,null,null,null,null,"--",0,null,null,{"$f":"(K376/Instructions!$C$23)*100","v":0},{"$f":"(L376/Instructions!$C$24)*100","v":0},{"$f":"(M376/Instructions!$C$25)*100","v":0},{"$f":"(N376/Instructions!$C$26)*100","v":0},{"$f":"(O376/Instructions!$C$27)*100","v":0},{"$f":"(U376/'Report Card'!$H$22)*100","v":{"$error":"#VALUE!"}},"----","E","E","E","E","E","--",null,null,null,null,null,{"$f":"Table_2[[#This Row],[Column51]]&Table_2[[#This Row],[Column52]]&AM378","v":""}]
[376,null,null,null,null,null,null,null,null,null,null,null,null,null,null,null,null,null,null,null,"--",0,null,null,{"$f":"(K377/Instructions!$C$23)*100","v":0},{"$f":"(L377/Instructions!$C$24)*100","v":0},{"$f":"(M377/Instructions!$C$25)*100","v":0},{"$f":"(N377/Instructions!$C$26)*100","v":0},{"$f":"(O377/Instructions!$C$27)*100","v":0},{"$f":"(U377/'Report Card'!$H$22)*100","v":{"$error":"#VALUE!"}},"----","E","E","E","E","E","--",null,null,null,null,null,{"$f":"Table_2[[#This Row],[Column51]]&Table_2[[#This Row],[Column52]]&AM379","v":""}]
[377,null,null,null,null,null,null,null,null,null,null,null,null,null,null,null,null,null,null,null,"--",0,null,null,{"$f":"(K378/Instructions!$C$23)*100","v":0},{"$f":"(L378/Instructions!$C$24)*100","v":0},{"$f":"(M378/Instructions!$C$25)*100","v":0},{"$f":"(N378/Instructions!$C$26)*100","v":0},{"$f":"(O378/Instructions!$C$27)*100","v":0},{"$f":"(U378/'Report Card'!$H$22)*100","v":{"$error":"#VALUE!"}},"----","E","E","E","E","E","--",null,null,null,null,null,{"$f":"Table_2[[#This Row],[Column51]]&Table_2[[#This Row],[Column52]]&AM380","v":""}]
[378,null,null,null,null,null,null,null,null,null,null,null,null,null,null,null,null,null,null,null,"--",0,null,null,{"$f":"(K379/Instructions!$C$23)*100","v":0},{"$f":"(L379/Instructions!$C$24)*100","v":0},{"$f":"(M379/Instructions!$C$25)*100","v":0},{"$f":"(N379/Instructions!$C$26)*100","v":0},{"$f":"(O379/Instructions!$C$27)*100","v":0},{"$f":"(U379/'Report Card'!$H$22)*100","v":{"$error":"#VALUE!"}},"----","E","E","E","E","E","--",null,null,null,null,null,{"$f":"Table_2[[#This Row],[Column51]]&Table_2[[#This Row],[Column52]]&AM381","v":""}]
[379,null,null,null,null,null,null,null,null,null,null,null,null,null,null,null,null,null,null,null,"--",0,null,null,{"$f":"(K380/Instructions!$C$23)*100","v":0},{"$f":"(L380/Instructions!$C$24)*100","v":0},{"$f":"(M380/Instructions!$C$25)*100","v":0},{"$f":"(N380/Instructions!$C$26)*100","v":0},{"$f":"(O380/Instructions!$C$27)*100","v":0},{"$f":"(U380/'Report Card'!$H$22)*100","v":{"$error":"#VALUE!"}},"----","E","E","E","E","E","--",null,null,null,null,null,{"$f":"Table_2[[#This Row],[Column51]]&Table_2[[#This Row],[Column52]]&AM382","v":""}]
[380,null,null,null,null,null,null,null,null,null,null,null,null,null,null,null,null,null,null,null,"--",0,null,null,{"$f":"(K381/Instructions!$C$23)*100","v":0},{"$f":"(L381/Instructions!$C$24)*100","v":0},{"$f":"(M381/Instructions!$C$25)*100","v":0},{"$f":"(N381/Instructions!$C$26)*100","v":0},{"$f":"(O381/Instructions!$C$27)*100","v":0},{"$f":"(U381/'Report Card'!$H$22)*100","v":{"$error":"#VALUE!"}},"----","E","E","E","E","E","--",null,null,null,null,null,{"$f":"Table_2[[#This Row],[Column51]]&Table_2[[#This Row],[Column52]]&AM383","v":""}]
[381,null,null,null,null,null,null,null,null,null,null,null,null,null,null,null,null,null,null,null,"--",0,null,null,{"$f":"(K382/Instructions!$C$23)*100","v":0},{"$f":"(L382/Instructions!$C$24)*100","v":0},{"$f":"(M382/Instructions!$C$25)*100","v":0},{"$f":"(N382/Instructions!$C$26)*100","v":0},{"$f":"(O382/Instructions!$C$27)*100","v":0},{"$f":"(U382/'Report Card'!$H$22)*100","v":{"$error":"#VALUE!"}},"----","E","E","E","E","E","--",null,null,null,null,null,{"$f":"Table_2[[#This Row],[Column51]]&Table_2[[#This Row],[Column52]]&AM384","v":""}]
[382,null,null,null,null,null,null,null,null,null,null,null,null,null,null,null,null,null,null,null,"--",0,null,null,{"$f":"(K383/Instructions!$C$23)*100","v":0},{"$f":"(L383/Instructions!$C$24)*100","v":0},{"$f":"(M383/Instructions!$C$25)*100","v":0},{"$f":"(N383/Instructions!$C$26)*100","v":0},{"$f":"(O383/Instructions!$C$27)*100","v":0},{"$f":"(U383/'Report Card'!$H$22)*100","v":{"$error":"#VALUE!"}},"----","E","E","E","E","E","--",null,null,null,null,null,{"$f":"Table_2[[#This Row],[Column51]]&Table_2[[#This Row],[Column52]]&AM385","v":""}]
[383,null,null,null,null,null,null,null,null,null,null,null,null,null,null,null,null,null,null,null,"--",0,null,null,{"$f":"(K384/Instructions!$C$23)*100","v":0},{"$f":"(L384/Instructions!$C$24)*100","v":0},{"$f":"(M384/Instructions!$C$25)*100","v":0},{"$f":"(N384/Instructions!$C$26)*100","v":0},{"$f":"(O384/Instructions!$C$27)*100","v":0},{"$f":"(U384/'Report Card'!$H$22)*100","v":{"$error":"#VALUE!"}},"----","E","E","E","E","E","--",null,null,null,null,null,{"$f":"Table_2[[#This Row],[Column51]]&Table_2[[#This Row],[Column52]]&AM386","v":""}]
[384,null,null,null,null,null,null,null,null,null,null,null,null,null,null,null,null,null,null,null,"--",0,null,null,{"$f":"(K385/Instructions!$C$23)*100","v":0},{"$f":"(L385/Instructions!$C$24)*100","v":0},{"$f":"(M385/Instructions!$C$25)*100","v":0},{"$f":"(N385/Instructions!$C$26)*100","v":0},{"$f":"(O385/Instructions!$C$27)*100","v":0},{"$f":"(U385/'Report Card'!$H$22)*100","v":{"$error":"#VALUE!"}},"----","E","E","E","E","E","--",null,null,null,null,null,{"$f":"Table_2[[#This Row],[Column51]]&Table_2[[#This Row],[Column52]]&AM387","v":""}]
[385,null,null,null,null,null,null,null,null,null,null,null,null,null,null,null,null,null,null,null,{"$f":"IF(MIN(Y386:AC386)>=33,SUM(K386:P386),\"--\")","v":"--"},0,null,null,{"$f":"(K386/Instructions!$C$23)*100","v":0},{"$f":"(L386/Instructions!$C$24)*100","v":0},{"$f":"(M386/Instructions!$C$25)*100","v":0},{"$f":"(N386/Instructions!$C$26)*100","v":0},{"$f":"(O386/Instructions!$C$27)*100","v":0},{"$f":"(U386/'Report Card'!$H$22)*100","v":{"$error":"#VALUE!"}},"----",{"$f":"IFERROR(IF(Y386>90,\"A+\",IF(Y386>80,\"A\",IF(Y386>70,\"B+\",IF(Y386>60,\"B\",IF(Y386>50,\"C+\",IF(Y386>40,\"C\",IF(Y386>=33,\"D\",\"E\"))))))),\"Abs\")","v":"E"},{"$f":"IFERROR(IF(Z386>90,\"A+\",IF(Z386>80,\"A\",IF(Z386>70,\"B+\",IF(Z386>60,\"B\",IF(Z386>50,\"C+\",IF(Z386>40,\"C\",IF(Z386>=33,\"D\",\"E\"))))))),\"Abs\")","v":"E"},{"$f":"IFERROR(IF(AA386>90,\"A+\",IF(AA386>80,\"A\",IF(AA386>70,\"B+\",IF(AA386>60,\"B\",IF(AA386>50,\"C+\",IF(AA386>40,\"C\",IF(AA386>=33,\"D\",\"E\"))))))),\"Abs\")","v":"E"},{"$f":"IFERROR(IF(AB386>90,\"A+\",IF(AB386>80,\"A\",IF(AB386>70,\"B+\",IF(AB386>60,\"B\",IF(AB386>50,\"C+\",IF(AB386>40,\"C\",IF(AB386>=33,\"D\",\"E\"))))))),\"Abs\")","v":"E"},{"$f":"IFERROR(IF(AC386>90,\"A+\",IF(AC386>80,\"A\",IF(AC386>70,\"B+\",IF(AC386>60,\"B\",IF(AC386>50,\"C+\",IF(AC386>40,\"C\",IF(AC386>=33,\"D\",\"E\"))))))),\"Abs\")","v":"E"},"--",null,null,null,null,null,{"$f":"Table_2[[#This Row],[Column51]]&Table_2[[#This Row],[Column52]]&AM388","v":""}]
[386,null,null,null,null,null,null,null,null,null,null,null,null,null,null,null,null,null,null,null,"--",{"$f":"IF(U387=\"--\",0,U387)","v":0},null,null,{"$f":"(K387/Instructions!$C$23)*100","v":0},{"$f":"(L387/Instructions!$C$24)*100","v":0},{"$f":"(M387/Instructions!$C$25)*100","v":0},{"$f":"(N387/Instructions!$C$26)*100","v":0},{"$f":"(O387/Instructions!$C$27)*100","v":0},{"$f":"(U387/'Report Card'!$H$22)*100","v":{"$error":"#VALUE!"}},{"$f":"IF(AND(Y387>=33,Z387>=33,AA387>=33,AB387>=33,AC387>=33),\"PASS\",\"----\")","v":"----"},"E","E","E","E","E",{"$f":"IFERROR(IF(AD387>90,\"A+\",IF(AD387>80,\"A\",IF(AD387>70,\"B+\",IF(AD387>60,\"B\",IF(AD387>50,\"C+\",IF(AD387>40,\"C\",IF(AD387>=33,\"D\",\"E\"))))))),\"--\")","v":"--"},null,null,null,null,null,{"$f":"Table_2[[#This Row],[Column51]]&Table_2[[#This Row],[Column52]]&AM389","v":""}]
[387,null,null,null,null,null,null,null,null,null,null,null,null,null,null,null,null,null,null,null,"--",0,null,null,{"$f":"(K388/Instructions!$C$23)*100","v":0},{"$f":"(L388/Instructions!$C$24)*100","v":0},{"$f":"(M388/Instructions!$C$25)*100","v":0},{"$f":"(N388/Instructions!$C$26)*100","v":0},{"$f":"(O388/Instructions!$C$27)*100","v":0},{"$f":"(U388/'Report Card'!$H$22)*100","v":{"$error":"#VALUE!"}},"----","E","E","E","E","E","--",null,null,null,null,null,{"$f":"Table_2[[#This Row],[Column51]]&Table_2[[#This Row],[Column52]]&AM390","v":""}]
[388,null,null,null,null,null,null,null,null,null,null,null,null,null,null,null,null,null,null,null,"--",0,null,null,{"$f":"(K389/Instructions!$C$23)*100","v":0},{"$f":"(L389/Instructions!$C$24)*100","v":0},{"$f":"(M389/Instructions!$C$25)*100","v":0},{"$f":"(N389/Instructions!$C$26)*100","v":0},{"$f":"(O389/Instructions!$C$27)*100","v":0},{"$f":"(U389/'Report Card'!$H$22)*100","v":{"$error":"#VALUE!"}},"----","E","E","E","E","E","--",null,null,null,null,null,{"$f":"Table_2[[#This Row],[Column51]]&Table_2[[#This Row],[Column52]]&AM391","v":""}]
[389,null,null,null,null,null,null,null,null,null,null,null,null,null,null,null,null,null,null,null,"--",0,null,null,{"$f":"(K390/Instructions!$C$23)*100","v":0},{"$f":"(L390/Instructions!$C$24)*100","v":0},{"$f":"(M390/Instructions!$C$25)*100","v":0},{"$f":"(N390/Instructions!$C$26)*100","v":0},{"$f":"(O390/Instructions!$C$27)*100","v":0},{"$f":"(U390/'Report Card'!$H$22)*100","v":{"$error":"#VALUE!"}},"----","E","E","E","E","E","--",null,null,null,null,null,{"$f":"Table_2[[#This Row],[Column51]]&Table_2[[#This Row],[Column52]]&AM392","v":""}]
[390,null,null,null,null,null,null,null,null,null,null,null,null,null,null,null,null,null,null,null,"--",0,null,null,{"$f":"(K391/Instructions!$C$23)*100","v":0},{"$f":"(L391/Instructions!$C$24)*100","v":0},{"$f":"(M391/Instructions!$C$25)*100","v":0},{"$f":"(N391/Instructions!$C$26)*100","v":0},{"$f":"(O391/Instructions!$C$27)*100","v":0},{"$f":"(U391/'Report Card'!$H$22)*100","v":{"$error":"#VALUE!"}},"----","E","E","E","E","E","--",null,null,null,null,null,{"$f":"Table_2[[#This Row],[Column51]]&Table_2[[#This Row],[Column52]]&AM393","v":""}]
[391,null,null,null,null,null,null,null,null,null,null,null,null,null,null,null,null,null,null,null,"--",0,null,null,{"$f":"(K392/Instructions!$C$23)*100","v":0},{"$f":"(L392/Instructions!$C$24)*100","v":0},{"$f":"(M392/Instructions!$C$25)*100","v":0},{"$f":"(N392/Instructions!$C$26)*100","v":0},{"$f":"(O392/Instructions!$C$27)*100","v":0},{"$f":"(U392/'Report Card'!$H$22)*100","v":{"$error":"#VALUE!"}},"----","E","E","E","E","E","--",null,null,null,null,null,{"$f":"Table_2[[#This Row],[Column51]]&Table_2[[#This Row],[Column52]]&AM394","v":""}]
[392,null,null,null,null,null,null,null,null,null,null,null,null,null,null,null,null,null,null,null,"--",0,null,null,{"$f":"(K393/Instructions!$C$23)*100","v":0},{"$f":"(L393/Instructions!$C$24)*100","v":0},{"$f":"(M393/Instructions!$C$25)*100","v":0},{"$f":"(N393/Instructions!$C$26)*100","v":0},{"$f":"(O393/Instructions!$C$27)*100","v":0},{"$f":"(U393/'Report Card'!$H$22)*100","v":{"$error":"#VALUE!"}},"----","E","E","E","E","E","--",null,null,null,null,null,{"$f":"Table_2[[#This Row],[Column51]]&Table_2[[#This Row],[Column52]]&AM395","v":""}]
[393,null,null,null,null,null,null,null,null,null,null,null,null,null,null,null,null,null,null,null,"--",0,null,null,{"$f":"(K394/Instructions!$C$23)*100","v":0},{"$f":"(L394/Instructions!$C$24)*100","v":0},{"$f":"(M394/Instructions!$C$25)*100","v":0},{"$f":"(N394/Instructions!$C$26)*100","v":0},{"$f":"(O394/Instructions!$C$27)*100","v":0},{"$f":"(U394/'Report Card'!$H$22)*100","v":{"$error":"#VALUE!"}},"----","E","E","E","E","E","--",null,null,null,null,null,{"$f":"Table_2[[#This Row],[Column51]]&Table_2[[#This Row],[Column52]]&AM396","v":""}]
[394,null,null,null,null,null,null,null,null,null,null,null,null,null,null,null,null,null,null,null,"--",0,null,null,{"$f":"(K395/Instructions!$C$23)*100","v":0},{"$f":"(L395/Instructions!$C$24)*100","v":0},{"$f":"(M395/Instructions!$C$25)*100","v":0},{"$f":"(N395/Instructions!$C$26)*100","v":0},{"$f":"(O395/Instructions!$C$27)*100","v":0},{"$f":"(U395/'Report Card'!$H$22)*100","v":{"$error":"#VALUE!"}},"----","E","E","E","E","E","--",null,null,null,null,null,{"$f":"Table_2[[#This Row],[Column51]]&Table_2[[#This Row],[Column52]]&AM397","v":""}]
[395,null,null,null,null,null,null,null,null,null,null,null,null,null,null,null,null,null,null,null,"--",0,null,null,{"$f":"(K396/Instructions!$C$23)*100","v":0},{"$f":"(L396/Instructions!$C$24)*100","v":0},{"$f":"(M396/Instructions!$C$25)*100","v":0},{"$f":"(N396/Instructions!$C$26)*100","v":0},{"$f":"(O396/Instructions!$C$27)*100","v":0},{"$f":"(U396/'Report Card'!$H$22)*100","v":{"$error":"#VALUE!"}},"----","E","E","E","E","E","--",null,null,null,null,null,{"$f":"Table_2[[#This Row],[Column51]]&Table_2[[#This Row],[Column52]]&AM398","v":""}]
[396,null,null,null,null,null,null,null,null,null,null,null,null,null,null,null,null,null,null,null,"--",0,null,null,{"$f":"(K397/Instructions!$C$23)*100","v":0},{"$f":"(L397/Instructions!$C$24)*100","v":0},{"$f":"(M397/Instructions!$C$25)*100","v":0},{"$f":"(N397/Instructions!$C$26)*100","v":0},{"$f":"(O397/Instructions!$C$27)*100","v":0},{"$f":"(U397/'Report Card'!$H$22)*100","v":{"$error":"#VALUE!"}},"----","E","E","E","E","E","--",null,null,null,null,null,{"$f":"Table_2[[#This Row],[Column51]]&Table_2[[#This Row],[Column52]]&AM399","v":""}]
[397,null,null,null,null,null,null,null,null,null,null,null,null,null,null,null,null,null,null,null,"--",0,null,null,{"$f":"(K398/Instructions!$C$23)*100","v":0},{"$f":"(L398/Instructions!$C$24)*100","v":0},{"$f":"(M398/Instructions!$C$25)*100","v":0},{"$f":"(N398/Instructions!$C$26)*100","v":0},{"$f":"(O398/Instructions!$C$27)*100","v":0},{"$f":"(U398/'Report Card'!$H$22)*100","v":{"$error":"#VALUE!"}},"----","E","E","E","E","E","--",null,null,null,null,null,{"$f":"Table_2[[#This Row],[Column51]]&Table_2[[#This Row],[Column52]]&AM400","v":""}]
[398,null,null,null,null,null,null,null,null,null,null,null,null,null,null,null,null,null,null,null,"--",0,null,null,{"$f":"(K399/Instructions!$C$23)*100","v":0},{"$f":"(L399/Instructions!$C$24)*100","v":0},{"$f":"(M399/Instructions!$C$25)*100","v":0},{"$f":"(N399/Instructions!$C$26)*100","v":0},{"$f":"(O399/Instructions!$C$27)*100","v":0},{"$f":"(U399/'Report Card'!$H$22)*100","v":{"$error":"#VALUE!"}},"----","E","E","E","E","E","--",null,null,null,null,null,{"$f":"Table_2[[#This Row],[Column51]]&Table_2[[#This Row],[Column52]]&AM401","v":""}]
[399,null,null,null,null,null,null,null,null,null,null,null,null,null,null,null,null,null,null,null,"--",0,null,null,{"$f":"(K400/Instructions!$C$23)*100","v":0},{"$f":"(L400/Instructions!$C$24)*100","v":0},{"$f":"(M400/Instructions!$C$25)*100","v":0},{"$f":"(N400/Instructions!$C$26)*100","v":0},{"$f":"(O400/Instructions!$C$27)*100","v":0},{"$f":"(U400/'Report Card'!$H$22)*100","v":{"$error":"#VALUE!"}},"----","E","E","E","E","E","--",null,null,null,null,null,{"$f":"Table_2[[#This Row],[Column51]]&Table_2[[#This Row],[Column52]]&AM402","v":""}]
[400,null,null,null,null,null,null,null,null,null,null,null,null,null,null,null,null,null,null,null,"--",0,null,null,{"$f":"(K401/Instructions!$C$23)*100","v":0},{"$f":"(L401/Instructions!$C$24)*100","v":0},{"$f":"(M401/Instructions!$C$25)*100","v":0},{"$f":"(N401/Instructions!$C$26)*100","v":0},{"$f":"(O401/Instructions!$C$27)*100","v":0},{"$f":"(U401/'Report Card'!$H$22)*100","v":{"$error":"#VALUE!"}},"----","E","E","E","E","E","--",null,null,null,null,null,{"$f":"Table_2[[#This Row],[Column51]]&Table_2[[#This Row],[Column52]]&AM403","v":""}]
[null,null,null,null,null,null,null,null,null,null,null,null,null,null,null,null,null,null,null,null,null,null,null,null,null,null,null,null,null,null,null,null,null,null,null,null,null,null,null,null,null,null,{"$f":"Table_2[[#This Row],[Column51]]&Table_2[[#This Row],[Column52]]&AM404","v":""}]
[null,null,null,null,null,null,null,null,null,null,null,null,null,null,null,null,null,null,null,null,null,null,null,null,null,null,null,null,null,null,null,null,null,null,null,null,null,null,null,null,null,null,{"$f":"Table_2[[#This Row],[Column51]]&Table_2[[#This Row],[Column52]]&AM405","v":""}]

{"sheet":"Report Card","index":2,"n_rows":35,"n_cols":20,"rows_kept":35,"cut":false,"hidden":false,"merged":[[20,2,20,5],[21,3,21,4],[21,5,21,6],[5,0,5,10],[32,2,32,4],[26,1,26,4],[27,1,27,4],[28,1,28,4],[26,5,26,8],[27,5,27,8],[28,5,28,8],[22,1,22,9],[25,5,25,8],[25,1,25,4],[24,1,24,8],[7,4,7,7],[8,4,8,7],[1,0,1,3],[11,4,11,7],[11,8,11,9],[15,2,15,5],[15,6,15,7],[9,4,9,7],[9,8,9,9],[10,4,10,7],[10,8,10,9],[11,1,11,3],[12,1,12,9],[13,1,13,9],[14,2,14,5],[14,6,14,7],[8,8,8,9],[34,8,34,10],[6,12,7,12],[9,1,9,3],[10,1,10,3],[7,1,7,3],[8,1,8,3],[16,2,16,5],[16,6,16,7],[17,2,17,5],[17,6,17,7],[18,2,18,5],[18,6,18,7],[19,2,19,5],[19,6,19,7],[20,6,20,7],[21,1,21,2]]}
[]
[{"$f":"\"        Serial No./\"&Q3&\"/\"&R3&\"/\"&N8","v":"        Serial No./March/2024/6"}]
[null,null,null,null,null,null,null,null,null,null,null,null,null,null,null,null,{"$f":"Instructions!C19","v":"March"},{"$f":"Instructions!B19","v":2024}]
[]
[null,null,null,null,null,null,null,null,null,null,null,null,"Total Number of Record",{"$f":"COUNTA('Marks Entry'!F:F)","v":1}]
[{"$f":"\"Report Card \"&Q3& \" - \"&R3","v":"Report Card March - 2024"}]
[null,null,null,null,null,null,null,null,null,null,null,null,"Sr No. of Record"]
[null,"Student Name        :",null,null,{"$f":"IFERROR(VLOOKUP($N$8,'Marks Entry'!$A$1:$AO$401,6,0),\"\")","v":0},null,null,null,null,null,null,null,null,6]
[null,"E-Punjab ID              :",null,null,{"$f":"IFERROR(VLOOKUP($N$8,'Marks Entry'!$A$1:$AO$401,5,0),\"\")","v":0},null,null,null,null,null,null,null,null,null,null,null,null,null,null,{"$f":"IFERROR(VLOOKUP($N$8,'Marks Entry'!$A$1:$AO$401,3,0),\"\")","v":0}]
[null,"Father’s Name       :",null,null,{"$f":"IFERROR(VLOOKUP($N$8,'Marks Entry'!$A$1:$AO$401,7,0),\"\")","v":0}]
[null,"Mother’s Name     :",null,null,{"$f":"IFERROR(VLOOKUP($N$8,'Marks Entry'!$A$1:$AO$401,8,0),\"\")","v":0}]
[null,"Class & Section      :",null,null,{"$f":"IFERROR(VLOOKUP($N$8,'Marks Entry'!$A$1:$AO$401,3,0)&\" \"&VLOOKUP($N$8,'Marks Entry'!$A$1:$AO$401,4,0),\"\")","v":" "}]
[null,{"$f":"\"has secured subject wise marks and grade as mentioned below in School Examination held in \" & Q3 & \"  \"&R3","v":"has secured subject wise marks and grade as mentioned below in School Examination held in March  2024"}]
[]
[null,"Sr. no.","Subject Name",null,null,null,"Total Marks",null,"Marks Obtained","Grade"]
[null,1,"PUNJABI",null,null,null,{"$f":"Instructions!C23","v":100},null,{"$f":"IFERROR(VLOOKUP($N$8,'Marks Entry'!$A$1:$AO$401,11,0),\"\")","v":0},{"$f":"IFERROR(VLOOKUP($N$8,'Marks Entry'!$A$1:$AO$401,32,0),\"\")","v":"E"}]
[null,2,"ENGLISH",null,null,null,{"$f":"Instructions!C24","v":100},null,{"$f":"IFERROR(VLOOKUP($N$8,'Marks Entry'!$A$1:$AO$401,12,0),\"\")","v":0},{"$f":"IFERROR(VLOOKUP($N$8,'Marks Entry'!$A$1:$AO$401,33,0),\"\")","v":"E"}]
[null,3,"MATHEMATICS",null,null,null,{"$f":"Instructions!C25","v":100},null,{"$f":"IFERROR(VLOOKUP($N$8,'Marks Entry'!$A$1:$AO$401,13,0),\"\")","v":0},{"$f":"IFERROR(VLOOKUP($N$8,'Marks Entry'!$A$1:$AO$401,34,0),\"\")","v":"E"}]
[null,{"$f":"IF(OR(T9=\"5th\",T9=\"4th\",T9=\"3rd\"),4,\"\")","v":""},{"$f":"IF(OR(T9=\"5th\",T9=\"4th\",T9=\"3rd\"),\"ENVIRONMENT EDUCATION\",\"\")","v":""},null,null,null,{"$f":"IF(B19=4,Instructions!C26,\"\")","v":""},null,{"$f":"IFERROR(IF(B19=4,(VLOOKUP($N$8,'Marks Entry'!$A$1:$AO$401,14,0)),\"\"),\"\")","v":""},{"$f":"IFERROR(IF(B19=4,(VLOOKUP($N$8,'Marks Entry'!$A$1:$AO$401,35,0)),\"\"),\"\")","v":""}]
[null,{"$f":"IF(OR(T9=\"5th\",T9=\"4th\"),5,\"\")","v":""},{"$f":"IF(OR(T9=\"5th\",T9=\"4th\"),\"HINDI\",\"\")","v":""},null,null,null,{"$f":"IF(B20=5,Instructions!C27,\"\")","v":""},null,{"$f":"IFERROR(IF(B20=5,(VLOOKUP($N$8,'Marks Entry'!$A$1:$AO$401,15,0)),\"\"),\"\")","v":""},{"$f":"IFERROR(IF(B20=5,(VLOOKUP($N$8,'Marks Entry'!$A$1:$AO$401,36,0)),\"\"),\"\")","v":""}]
[]
[null,"RESULT    :",null,{"$f":"IFERROR(VLOOKUP($N$8,'Marks Entry'!$A$1:$AO$401,31,0),\"\")","v":"----"},null,"Grand Total",null,{"$f":"IF(B20=5,500,IF(B19=4,400,300))","v":300},{"$f":"IFERROR(VLOOKUP($N$8,'Marks Entry'!$A$1:$AO$401,21,0),\"\")","v":"--"},{"$f":"IFERROR(VLOOKUP($N$8,'Marks Entry'!$A$1:$AO$401,37,0),\"\")","v":"--"}]
[null,"Note: * Implies marks obtained in subjects are grading subjects and have not been added in Grand Total"]
[]
[null,"Grade Description"]
[null,"A+  Above 90% marks ",null,null,null,"A  Above 80% & upto 90% marks"]
[null,"B+  Above 70% & upto  80% marks",null,null,null,"B  Above 60% & upto 70% marks"]
[null,"C+  Above 50% & upto 60% marks",null,null,null,"C  Above 40% & upto 50% marks"]
[null,"D   33%  & upto 40% marks",null,null,null,"E Below 33% marks"]
[]
[]
[]
[null,"Date   :  ",{"$f":"Instructions!C20","v":"2024-03-31"},null,null,null,null,null,null,"Signature "]
[]
[null,null,null,null,null,null,null,null,"www.Teachershelp.in  "]

{"sheet":"Abstract","index":3,"n_rows":14,"n_cols":16,"rows_kept":14,"cut":false,"hidden":false,"merged":[[0,0,0,10],[0,13,0,15],[13,1,13,4]]}
["Subject & Grade Wise  Students Counts Details",null,null,null,null,null,null,null,null,null,null,null,null,{"$f":"\"Topper of Class \"&B2","v":"Topper of Class 2nd"}]
["Class","2nd","Section","A",null,null,null,null,null,null,null,null,null,"Rank","Student Name","Marks"]
["Grade/Subject","Punjabi ","English","Hindi","Maths.","Science",null,null,null,null,null,null,null,1,"ASHOK",500]
["A+",{"$f":"COUNTIFS('Marks Entry'!$C:$C,$B$2,'Marks Entry'!$D:$D,$D$2,'Marks Entry'!AF:AF,$A4)","v":0},{"$f":"COUNTIFS('Marks Entry'!$C:$C,$B$2,'Marks Entry'!$D:$D,$D$2,'Marks Entry'!AG:AG,$A4)","v":0},{"$f":"COUNTIFS('Marks Entry'!$C:$C,$B$2,'Marks Entry'!$D:$D,$D$2,'Marks Entry'!AH:AH,$A4)","v":0},{"$f":"COUNTIFS('Marks Entry'!$C:$C,$B$2,'Marks Entry'!$D:$D,$D$2,'Marks Entry'!AI:AI,$A4)","v":0},{"$f":"COUNTIFS('Marks Entry'!$C:$C,$B$2,'Marks Entry'!$D:$D,$D$2,'Marks Entry'!AJ:AJ,$A4)","v":0},null,null,null,null,null,null,null,2,"CHAMAN",500]
["A",{"$f":"COUNTIFS('Marks Entry'!$C:$C,$B$2,'Marks Entry'!$D:$D,$D$2,'Marks Entry'!AF:AF,$A5)","v":0},{"$f":"COUNTIFS('Marks Entry'!$C:$C,$B$2,'Marks Entry'!$D:$D,$D$2,'Marks Entry'!AG:AG,$A5)","v":0},{"$f":"COUNTIFS('Marks Entry'!$C:$C,$B$2,'Marks Entry'!$D:$D,$D$2,'Marks Entry'!AH:AH,$A5)","v":0},{"$f":"COUNTIFS('Marks Entry'!$C:$C,$B$2,'Marks Entry'!$D:$D,$D$2,'Marks Entry'!AI:AI,$A5)","v":0},{"$f":"COUNTIFS('Marks Entry'!$C:$C,$B$2,'Marks Entry'!$D:$D,$D$2,'Marks Entry'!AJ:AJ,$A5)","v":0},null,null,null,null,null,null,null,3,"ARIF",499]
["B+",{"$f":"COUNTIFS('Marks Entry'!$C:$C,$B$2,'Marks Entry'!$D:$D,$D$2,'Marks Entry'!AF:AF,$A6)","v":0},{"$f":"COUNTIFS('Marks Entry'!$C:$C,$B$2,'Marks Entry'!$D:$D,$D$2,'Marks Entry'!AG:AG,$A6)","v":0},{"$f":"COUNTIFS('Marks Entry'!$C:$C,$B$2,'Marks Entry'!$D:$D,$D$2,'Marks Entry'!AH:AH,$A6)","v":0},{"$f":"COUNTIFS('Marks Entry'!$C:$C,$B$2,'Marks Entry'!$D:$D,$D$2,'Marks Entry'!AI:AI,$A6)","v":0},{"$f":"COUNTIFS('Marks Entry'!$C:$C,$B$2,'Marks Entry'!$D:$D,$D$2,'Marks Entry'!AJ:AJ,$A6)","v":0},null,null,null,null,null,null,null,4,"KAJAL",488]
["B",{"$f":"COUNTIFS('Marks Entry'!$C:$C,$B$2,'Marks Entry'!$D:$D,$D$2,'Marks Entry'!AF:AF,$A7)","v":0},{"$f":"COUNTIFS('Marks Entry'!$C:$C,$B$2,'Marks Entry'!$D:$D,$D$2,'Marks Entry'!AG:AG,$A7)","v":0},{"$f":"COUNTIFS('Marks Entry'!$C:$C,$B$2,'Marks Entry'!$D:$D,$D$2,'Marks Entry'!AH:AH,$A7)","v":0},{"$f":"COUNTIFS('Marks Entry'!$C:$C,$B$2,'Marks Entry'!$D:$D,$D$2,'Marks Entry'!AI:AI,$A7)","v":0},{"$f":"COUNTIFS('Marks Entry'!$C:$C,$B$2,'Marks Entry'!$D:$D,$D$2,'Marks Entry'!AJ:AJ,$A7)","v":0},null,null,null,null,null,null,null,5,"GUDIA",483]
["C+",{"$f":"COUNTIFS('Marks Entry'!$C:$C,$B$2,'Marks Entry'!$D:$D,$D$2,'Marks Entry'!AF:AF,$A8)","v":0},{"$f":"COUNTIFS('Marks Entry'!$C:$C,$B$2,'Marks Entry'!$D:$D,$D$2,'Marks Entry'!AG:AG,$A8)","v":0},{"$f":"COUNTIFS('Marks Entry'!$C:$C,$B$2,'Marks Entry'!$D:$D,$D$2,'Marks Entry'!AH:AH,$A8)","v":0},{"$f":"COUNTIFS('Marks Entry'!$C:$C,$B$2,'Marks Entry'!$D:$D,$D$2,'Marks Entry'!AI:AI,$A8)","v":0},{"$f":"COUNTIFS('Marks Entry'!$C:$C,$B$2,'Marks Entry'!$D:$D,$D$2,'Marks Entry'!AJ:AJ,$A8)","v":0}]
["C",{"$f":"COUNTIFS('Marks Entry'!$C:$C,$B$2,'Marks Entry'!$D:$D,$D$2,'Marks Entry'!AF:AF,$A9)","v":0},{"$f":"COUNTIFS('Marks Entry'!$C:$C,$B$2,'Marks Entry'!$D:$D,$D$2,'Marks Entry'!AG:AG,$A9)","v":0},{"$f":"COUNTIFS('Marks Entry'!$C:$C,$B$2,'Marks Entry'!$D:$D,$D$2,'Marks Entry'!AH:AH,$A9)","v":0},{"$f":"COUNTIFS('Marks Entry'!$C:$C,$B$2,'Marks Entry'!$D:$D,$D$2,'Marks Entry'!AI:AI,$A9)","v":0},{"$f":"COUNTIFS('Marks Entry'!$C:$C,$B$2,'Marks Entry'!$D:$D,$D$2,'Marks Entry'!AJ:AJ,$A9)","v":0}]
["D",{"$f":"COUNTIFS('Marks Entry'!$C:$C,$B$2,'Marks Entry'!$D:$D,$D$2,'Marks Entry'!AF:AF,$A10)","v":0},{"$f":"COUNTIFS('Marks Entry'!$C:$C,$B$2,'Marks Entry'!$D:$D,$D$2,'Marks Entry'!AG:AG,$A10)","v":0},{"$f":"COUNTIFS('Marks Entry'!$C:$C,$B$2,'Marks Entry'!$D:$D,$D$2,'Marks Entry'!AH:AH,$A10)","v":0},{"$f":"COUNTIFS('Marks Entry'!$C:$C,$B$2,'Marks Entry'!$D:$D,$D$2,'Marks Entry'!AI:AI,$A10)","v":0},{"$f":"COUNTIFS('Marks Entry'!$C:$C,$B$2,'Marks Entry'!$D:$D,$D$2,'Marks Entry'!AJ:AJ,$A10)","v":0}]
["E",{"$f":"COUNTIFS('Marks Entry'!$C:$C,$B$2,'Marks Entry'!$D:$D,$D$2,'Marks Entry'!AF:AF,$A11)","v":0},{"$f":"COUNTIFS('Marks Entry'!$C:$C,$B$2,'Marks Entry'!$D:$D,$D$2,'Marks Entry'!AG:AG,$A11)","v":0},{"$f":"COUNTIFS('Marks Entry'!$C:$C,$B$2,'Marks Entry'!$D:$D,$D$2,'Marks Entry'!AH:AH,$A11)","v":0},{"$f":"COUNTIFS('Marks Entry'!$C:$C,$B$2,'Marks Entry'!$D:$D,$D$2,'Marks Entry'!AI:AI,$A11)","v":0},{"$f":"COUNTIFS('Marks Entry'!$C:$C,$B$2,'Marks Entry'!$D:$D,$D$2,'Marks Entry'!AJ:AJ,$A11)","v":0}]
["Total Student",{"$f":"SUM(B4:B11)","v":0},{"$f":"SUM(C4:C11)","v":0},0,0,0]
[]
[null,"Total Fail/Reappear Students ",null,null,null,{"$f":"COUNTIFS('Marks Entry'!C2:C500,B2,'Marks Entry'!V2:V500,0)","v":0}]